{"text_format":"1","workbook":"xlsx","n_sheets":24,"sheets":["STAP 1","INSTRUCTIE BUDGETAANVRAAG","BUDGETAANVRAAG","GOEDGEKEURD INI BUDGET","INSTRUCTIE BUDGETWIJZIGING","AANVRAAG BUDGET AJU","GOEDGEKEURD BUDGET AJU","INSTRUCTIE WERKELIJKE UITGAVEN","VRAGEN EINDRAPPORT","ARGUMENTATIE","Samenvatting Budget-Uitgaven","Personeelskosten","Huur","Investeringen","Directe werkingskosten","Indirecte werkingskosten","Bijkomende vragen Fin Verslag","Antwoorden op FIN vragen","Overzicht budget-uitgaven","BUDGET VS ACTUAL","FEEDBACK Tussentijds Verslag","FEEDBACK Eindverslag","FINAAL CONTROLE VERSLAG","Dropdownlijst"],"not_rendered":{"charts":0,"images":6,"macros":1,"external_links":0,"defined_names":26,"comments":6,"pivot_tables":0},"unopened":[],"bounds":{"document_bytes":16777216,"sheet_cells":100000,"rows_first":2000,"rows_last":500,"rows_between":2000,"halvings":0,"cell_chars":16384,"cell_head_chars":4096},"cells_cut":0,"cells_raw":0,"read":"whole","date_system":"1900"}

{"sheet":"STAP 1","index":0,"n_rows":41,"n_cols":2,"rows_kept":41,"cut":false,"hidden":false,"merged":[[47,0,47,14],[25,0,25,14],[26,0,26,14],[27,0,27,14],[28,0,28,14],[29,0,29,14],[31,0,31,14],[40,0,40,14],[42,0,42,14],[45,0,45,14],[46,0,46,14],[43,0,43,14],[30,0,30,14],[44,0,44,14],[41,0,41,14],[32,0,32,14],[9,0,9,14],[14,0,14,2],[14,3,14,14],[6,0,7,14],[10,0,10,2],[10,3,10,14],[11,0,11,2],[11,3,11,14],[24,0,24,14],[15,0,15,2],[15,3,15,14],[12,0,12,2],[12,3,12,14],[18,0,18,14],[13,0,13,2],[13,3,13,14],[16,0,16,2],[16,3,16,14]]}
[]
[null,1]
[]
[]
[]
[]
["FINANCIEEL DOSSIER"]
[]
[]
["CONTACTGEGEVENS PROJECT"]
["Begunstigde (vzw):"]
["Naam Project:"]
["Korte Beschrijving Project:"]
["Financieel Contactpersoon: "]
["Telefoonnummer: "]
["Mail:"]
["IBAN nummer:"]
[]
["OPGELET! Indien BEVEILIGINGSWAARSCHUWING zichtbaar is gelieve op 'inhoud inschakelen' te klikken"]
[]
[]
[]
[]
[]
["WAT WENST U NU TE DOEN?"]
["← klik op button"]
["← klik op button"]
["← klik op button"]
["← klik op button"]
["← klik op button"]
["← klik op button"]
["← klik op button"]
["← klik op button"]
[]
[]
[]
[]
[]
[]
[]
["FEDASIL GEDEELTE"]

{"sheet":"INSTRUCTIE BUDGETAANVRAAG","index":1,"n_rows":41,"n_cols":1,"rows_kept":41,"cut":false,"hidden":true,"merged":[[24,0,27,0]]}
["INSTRUCTIE BUDGETAANVRAAG"]
[]
["BUDGETAANVRAAG BIJ NIEUW PROJECT OF PROJECTVERLENGING"]
["TIMING INDIENING"]
[" Ten laatste 1 oktober N-1 in het jaar vóór start projectjaar N"]
[]
["DOCUMENTEN"]
[" 1)  dit excel document die de volgende informatie moet bevatten: "]
["* budgetaanvraag per kostensoort gefinancieerd door Fedasil en/of andere financieringsbronnen"]
[" 2) het financieel onderdeel van het inhoudelijke verslag "]
[]
["FORMAAT VAN DE DOCUMENTEN"]
[" elektronische versie + gedrukte versie in één exemplaar"]
[]
["OPMERKINGEN BIJ HET INVULLEN VAN HET BUDGET"]
[" 1) De cellen in het blauw zijn aan te vullen"]
[" 2) De cellen in het wit bevatten formules"]
[" 3) Investeringen van meer dan € 500 dienen afgeschreven te worden"]
[]
[]
["BUDGETWIJZIGING TIJDENS DE LOOP VAN HET JAAR"]
["OVERDRACHT TUSSEN RUBRIEKEN<10%"]
["De begunstigde kan bij de uitvoering van het project de begroting aanpassen door overdrachten tussen rubrieken, mits deze aanpassing de uitvoering van het project niet in de weg staat en het bedrag van de overdracht tussen rubrieken niet meer bedraagt dan 10% van het bedrag van elke rubriek van het budget, en zonder dat dit het vermelde bedrag aan totale subsidiabele kosten wijzigt. Zij stellen het Agentschap hiervan schriftelijk in kennis. "]
["OVERDRACHT TUSSEN RUBRIEKEN>10%"]
["Overdrachten tussen rubrieken van meer dan 10% zijn uitzonderlijk aanvaardbaar mits deze aanpassing de uitvoering van het project niet in de weg staat en zonder dat dit het vermelde bedrag aan totale subsidiabele kosten wijzigt. \nDe begunstigde dient voorafgaandelijk het akkoord van het Agentschap te vragen aan de hand van een verzoek tot budgetwijziging, dat bestaat uit een vergelijking van het aangepast budget met het initieel budget en een uitgebreide argumentatie voor alle aanpassingen. \nDeze schriftelijke kennisgevingen en aanvragen tot budgetwijzigingen dienen steeds te gebeuren 1 maand voor het einde van de overeenkomst.\n\n"]
[]
[]
[]
[]
["TAB BUDGETWIJZIGING"]
["Het budgetwijzigingsdocument is reeds ingevuld aan de hand van het initieel goedgekeurd budget. Alle cellen die u in deze tab zal wijzigen, zullen"]
["automatische veranderen van kleur zodat de aanpassingen direct zichtbaar zijn. "]
[]
[]
["WAT WENST U NU TE DOEN?"]
["← klik op button"]
["← klik op button"]
["← klik op button"]
["← klik op button"]
[]
["WAT WENST U NU TE DOEN?"]

{"sheet":"BUDGETAANVRAAG","index":2,"n_rows":100,"n_cols":19,"rows_kept":100,"cut":false,"hidden":true,"merged":[[146,16,155,17],[146,18,155,18],[65,6,65,10],[135,16,144,17],[135,18,144,18],[145,16,145,18],[124,16,133,17],[124,18,133,18],[134,16,134,18],[113,16,122,17],[113,18,122,18],[123,16,123,18],[102,16,111,17],[102,18,111,18],[99,16,100,17],[99,18,100,18],[62,2,62,4],[54,2,54,3],[55,2,55,3],[56,2,56,3],[6,2,6,14],[62,5,62,6],[41,5,41,6],[42,5,42,6],[48,5,48,6],[43,5,43,6],[44,5,44,6],[45,5,45,6],[46,5,46,6],[47,5,47,6],[35,2,35,4],[49,2,49,4],[36,2,36,3],[38,2,38,3],[39,2,39,3],[47,2,47,4],[43,2,43,3],[57,2,57,3],[58,2,58,3],[40,2,40,3],[41,2,41,3],[42,2,42,3],[52,2,52,3],[61,2,61,3],[8,2,8,4],[9,2,9,4],[10,2,10,4],[11,2,11,4],[15,2,15,4],[17,3,17,4],[16,2,16,4],[18,3,18,4],[19,3,19,4],[20,3,20,4],[25,2,25,4],[26,2,26,4],[21,3,21,4],[22,3,22,4],[23,3,23,4],[84,6,84,9],[8,5,8,14],[9,5,9,14],[12,5,12,14],[13,5,13,14],[14,5,14,14],[10,5,10,14],[11,6,11,14],[66,2,66,9],[81,2,81,9],[32,2,32,4],[33,2,33,4],[34,2,34,4],[24,3,24,4],[27,2,27,4],[50,2,50,4],[38,5,38,6],[39,5,39,6],[40,5,40,6],[60,2,60,3],[3,12,3,14],[7,2,7,4],[7,5,7,14],[53,2,53,3],[59,2,59,3],[28,2,28,4],[29,2,29,4],[31,2,31,4],[44,2,44,3],[45,2,45,3],[46,2,46,3],[48,2,48,4]]}
[]
[]
[]
[null,null,null,null,null,null,null,null,null,null,null,null,"BUDGETAANVRAAG"]
[]
[]
[null,null,"BUDGET INI"]
[null,null,"Datum aanvraag:",null,null,{"$f":"TODAY()","v":"2020-09-11"}]
[null,null,"Begunstigde:",null,null,{"$f":"'STAP 1'!D11","v":0}]
[null,null,"Project:",null,null,{"$f":"'STAP 1'!D12","v":0}]
[null,null,"Financieel Contactpersoon: ",null,null,{"$f":"'STAP 1'!D14","v":0}]
[null,null,"Looptijd project (aantal maanden):",null,null,0,{"$f":"IF(OR(F12=0,F12>=13),\"Gelieve een correcte looptijd in te geven\",\" \")","v":"Gelieve een correcte looptijd in te geven"}]
[null,null,null,null,null,"INSTRUCTIE"]
[null,null,null,null,null,"!!!!! BLAUWE CELLEN ZIJN IN TE VULLEN CELLEN !!!!"]
[null,null,null,null,null,"!!!! WITTE CELLEN ZIJN CELLEN MET FORMULES !!!!"]
[null,null,"Budget 2021",null,null,"VTE","Eenheidskost (per maand)","Eenheidskost (per jaar)","Aantal maanden project","% van de tijd aan het project","Totaal bedrag project","Subsidievraag Fedasil (project of activiteit)","% Fedasil","Andere financierings-bronnen","% andere bronnen"]
[null,null,"Personeel",null,null,"(stap1)","(stap2)",null,"(stap3)","(stap4)",null,"(stap5)"]
[null,null,"(naam in te vullen)","(functie in te vullen)",null,0,0,{"$f":"G18*12","v":0},0,0,{"$f":"J18*I18*G18","v":0},0,{"$f":"IF(K18=0,0,L18/K18)","v":0},{"$f":"K18-L18","v":0},{"$f":"IF(K18=0,0,N18/K18)","v":0}]
[null,null,"(naam in te vullen)","(functie in te vullen)",null,0,0,{"$f":"G19*12","v":0},0,0,{"$f":"J19*I19*G19","v":0},0,{"$f":"IF(K19=0,0,L19/K19)","v":0},{"$f":"K19-L19","v":0},{"$f":"IF(K19=0,0,N19/K19)","v":0}]
[null,null,"(naam in te vullen)","(functie in te vullen)",null,0,0,0,0,0,0,0,{"$f":"IF(K20=0,0,L20/K20)","v":0},0,{"$f":"IF(K20=0,0,N20/K20)","v":0}]
[null,null,"(naam in te vullen)","(functie in te vullen)",null,0,0,0,0,0,0,0,0,0,0]
[null,null,"(naam in te vullen)","(functie in te vullen)",null,0,0,0,0,0,0,0,0,0,0]
[null,null,"(naam in te vullen)","(functie in te vullen)",null,0,0,0,0,0,0,0,0,0,0]
[null,null,"(naam in te vullen)","(functie in te vullen)",null,0,0,0,0,0,0,0,0,0,0]
[null,null,"(naam in te vullen)","(functie in te vullen)",null,0,0,{"$f":"G25*12","v":0},0,0,0,0,0,0,0]
[null,null,"Totaal",null,null,{"$f":"SUM(F18:F25)","v":0},null,{"$f":"SUM(H18:H25)","v":0},null,null,{"$f":"SUM(K18:K25)","v":0},{"$f":"SUM(L18:L25)","v":0},{"$f":"IF(K26=0,0,L26/K26)","v":0},{"$f":"SUM(N18:N25)","v":0},{"$f":"IF(K26=0,0,N26/K26)","v":0}]
[null,null,"Huur"]
[null,null,"(Voorwerp/Gebouw & Adres in te vullen)",null,null,null,0,{"$f":"+G28*12","v":0},0,0,{"$f":"J28*I28*G28","v":0},0,{"$f":"IF(K28=0,0,L28/K28)","v":0},{"$f":"K28-L28","v":0},{"$f":"IF(K28=0,0,N28/K28)","v":0}]
[null,null,"Totaal",null,null,null,null,{"$f":"SUM(H28:H28)","v":0},null,null,{"$f":"SUM(K28:K28)","v":0},{"$f":"SUM(L28:L28)","v":0},{"$f":"IF(K29=0,0,L29/K29)","v":0},{"$f":"SUM(N28:N28)","v":0},{"$f":"IF(K29=0,0,N29/K29)","v":0}]
[null,null,"Investeringen (afschrijven indien > € 500) "]
[]
[null,null,"(Beschrijving in te vullen)",null,null,null,null,0,null,0,{"$f":"H32*J32","v":0},0,0,{"$f":"K32-L32","v":0},0,{"$f":"IF(L32>500,\"Gelieve de regelgeving ivm afschrijvingen te respecteren\",\" \")","v":" "}]
[null,null,"(in te vullen)",null,null,null,null,0,null,0,{"$f":"H33*J33","v":0},0,0,{"$f":"K33-L33","v":0},0,{"$f":"IF(L33>500,\"Gelieve de regelgeving ivm afschrijvingen te respecteren\",\" \")","v":" "}]
[null,null,"(in te vullen)",null,null,null,null,0,null,0,{"$f":"H34*J34","v":0},0,0,{"$f":"K34-L34","v":0},0,{"$f":"IF(L34>500,\"Gelieve de regelgeving ivm afschrijvingen te respecteren\",\" \")","v":" "}]
[null,null,"(in te vullen)",null,null,null,null,0,null,0,{"$f":"H35*J35","v":0},0,0,{"$f":"K35-L35","v":0},0,{"$f":"IF(L35>500,\"Gelieve de regelgeving ivm afschrijvingen te respecteren\",\" \")","v":" "}]
[null,null,"Totaal",null,null,null,null,{"$f":"SUM(H32:H35)","v":0},null,null,{"$f":"SUM(K32:K35)","v":0},{"$f":"SUM(L32:L35)","v":0},0,{"$f":"SUM(N32:N35)","v":0},0]
[null,null,"Directe werkingskosten**"]
[]
[null,null,"Kies uit lijst Directe Werkingskosten",null,"\u0080",{"$f":"IF(C39=\"Onderaanneming \",\"Geef hier meer informatie over\",\" \")","v":" "},null,0,null,null,{"$f":"H39","v":0},0,0,{"$f":"K39-L39","v":0},0]
[null,null,"Kies uit lijst Directe Werkingskosten",null,"\u0080"," ",null,0,null,null,{"$f":"H40","v":0},0,0,{"$f":"K40-L40","v":0},0]
[null,null,"Kies uit lijst Directe Werkingskosten",null,"\u0080"," ",null,0,null,null,0,0,0,0,0]
[null,null,"Kies uit lijst Directe Werkingskosten",null,"\u0080"," ",null,0,null,null,0,0,0,0,0]
[null,null,"Kies uit lijst Directe Werkingskosten",null,"\u0080"," ",null,0,null,null,0,0,0,0,0]
[null,null,"Kies uit lijst Directe Werkingskosten",null,"\u0080"," ",null,0,null,null,0,0,0,{"$f":"K44-L44","v":0},0]
[null,null,"Kies uit lijst Directe Werkingskosten",null,"\u0080"," ",null,0,null,null,0,0,0,{"$f":"K45-L45","v":0},0]
[null,null,"Kies uit lijst Directe Werkingskosten",null,"\u0080"," ",null,0,null,null,0,0,0,{"$f":"K46-L46","v":0},0]
[null,null,"Kies uit lijst Directe Werkingskosten",null,"\u0080"," ",null,0,null,null,0,0,0,{"$f":"K47-L47","v":0},0]
[null,null,"Andere: (zelf in te vullen)",null,null," ",null,0,null,null,0,0,0,{"$f":"K48-L48","v":0},0]
[null,null,"Andere: (zelf in te vullen)",null,null," ",null,0,null,null,0,0,0,0,0]
[null,null,"Totaal",null,null,null,null,{"$f":"SUM(H39:H49)","v":0},null,null,{"$f":"SUM(K39:K49)","v":0},{"$f":"SUM(L39:L49)","v":0},{"$f":"IF(K50=0,0,L50/K50)","v":0},{"$f":"SUM(N39:N49)","v":0},0]
[null,null,"Indirecte werkingskosten***"]
[]
[null,null,"Kies uit lijst Indirecte Werkingskosten",null,"\u0080",null,null,0,null,0,{"$f":"H53*J53","v":0},0,0,{"$f":"K53-L53","v":0},0]
[null,null,"Kies uit lijst Indirecte Werkingskosten",null,"\u0080",null,null,0,null,0,0,0,0,{"$f":"K54-L54","v":0},0]
[null,null,"Kies uit lijst Indirecte Werkingskosten",null,"\u0080",null,null,0,null,0,0,0,0,0,0]
[null,null,"Kies uit lijst Indirecte Werkingskosten",null,"\u0080",null,null,0,null,0,0,0,0,0,0]
[null,null,"Kies uit lijst Indirecte Werkingskosten",null,"\u0080",null,null,0,null,0,{"$f":"H57*J57","v":0},0,0,{"$f":"K57-L57","v":0},0]
[null,null,"Kies uit lijst Indirecte Werkingskosten",null,"\u0080",null,null,0,null,0,{"$f":"H58*J58","v":0},0,0,{"$f":"K58-L58","v":0},0]
[null,null,"Kies uit lijst Indirecte Werkingskosten",null,"\u0080",null,null,0,null,0,0,0,0,0,0]
[null,null,"Kies uit lijst Indirecte Werkingskosten",null,"\u0080",null,null,0,null,0,0,0,0,0,0]
[null,null,"Kies uit lijst Indirecte Werkingskosten",null,"\u0080",null,null,0,null,0,0,0,0,0,0]
[null,null,"Kies uit lijst Indirecte Werkingskosten",null,"\u0080",null,null,0,null,0,{"$f":"H62*J62","v":0},0,{"$f":"IF(K62=0,0,L62/K62)","v":0},{"$f":"K62-L62","v":0},{"$f":"IF(K62=0,0,N62/K62)","v":0}]
[null,null,"Andere: (zelf in te vullen)",null,null,null,null,0,null,0,0,0,0,0,0]
[null,null,"Andere: (zelf in te vullen)",null,null,null,null,0,null,0,{"$f":"H64*J64","v":0},0,{"$f":"IF(K64=0,0,L64/K64)","v":0},{"$f":"K64-L64","v":0},{"$f":"IF(K64=0,0,N64/K64)","v":0}]
[null,null,"Totaal",null,null,null,null,{"$f":"SUM(H53:H64)","v":0},null,null,{"$f":"SUM(K53:K64)","v":0},{"$f":"SUM(L53:L64)","v":0},{"$f":"IF(K65=0,0,L65/K65)","v":0},{"$f":"SUM(N53:N64)","v":0},{"$f":"IF(K65=0,0,N65/K65)","v":0}]
[null,null,null,null,null,null,"MAX TOEGELATEN INDIRECTE KOSTEN ****:",null,null,null,null,{"$f":"(L26+L29+L36+L50)*0.07","v":0}]
[null,null,"TOTAAL",null,null,null,null,null,null,null,{"$f":"K65+K50+K36+K29+K26","v":0},{"$f":"L65+L50+L36+L29+L26","v":0},{"$f":"IF(K67=0,0,L67/K67)","v":0},{"$f":"N65+N50+N36+N29+N26","v":0},{"$f":"IF(K67=0,0,N67/K67)","v":0}]
[]
[null,null,"* Indien een gedeelte of het geheel van de subsidie als co-financiering wordt aangewend, moet de verdeling hier worden aangeduid. Gelieve, per project, een kolom toe te voegen."]
[null,null,"** Directe werkingskosten: Het gaat om kosten die boekhoudkundig aan het project of activiteit worden toegewezen. Indien niet mogelijk kunnen deze kosten worden gecategoriseerd als 'indirecte werkingskosten'. "]
[null,null,"*** Indirecte werkingskosten:'Het gaat om kosten die boekhoudkundig niet volledig aan het project of activiteit kunnen worden toegewezen. Deze kost wordt via een verdeelsleutel toegewezen. "]
[null,null,"     De gehanteerde verdeelsleutel moet verklaard worden in het inhoudelijk verslag. "]
[null,null,"**** max toegelaten indirecte kosten met Fedasil subsidies: 7% van de som van personeel, huur, investeringen en directe werkingskosten"]
[]
[null,null,"Financiering",null,null,null,"Detail financieringsbron","Zekerheid",null,null,"Totaal bedrag project","Subsidievraag Fedasil (project of activiteit)","% Fedasil","Andere financierings-bronnen","% andere bronnen"]
[null,null,"Fedasil",null,null,null,null,"Aangevraagd",null,null,{"$f":"L76","v":0},{"$f":"L67","v":0},{"$f":"IF($K$67=0,0,L76/$K$67)","v":0}]
[null,null,"Eigen middelen",null,null,null,null,"(in te vullen)",null,null,{"$f":"N77","v":0},null,null,0,{"$f":"IF($K$67=0,0,N77/$K$67)","v":0}]
[null,null,"Andere: (zelf in te vullen)",null,null,null,null,"(in te vullen)",null,null,{"$f":"N78","v":0},null,null,0,0]
[null,null,"Andere: (zelf in te vullen)",null,null,null,null,"(in te vullen)",null,null,{"$f":"N79","v":0},null,null,0,0]
[null,null,"Andere: (zelf in te vullen)",null,null,null,null,"(in te vullen)",null,null,{"$f":"N80","v":0},null,null,0,0]
[null,null,"Andere: (zelf in te vullen)",null,null,null,null,"(in te vullen)",null,null,{"$f":"N81","v":0},null,null,0,0]
[null,null,"TOTAAL",null,null,null,null,null,null,null,{"$f":"SUM(K76:K81)","v":0},{"$f":"SUM(L76:L81)","v":0},{"$f":"IF($K$67=0,0,L82/$K$67)","v":0},{"$f":"SUM(N77:N81)","v":0},0]
[]
[]
[null,null,null,null,null,null,"VERSCHIL TUSSEN BUDGET EN FINANCIERING",null,null,null,{"$f":"K67-K82","v":0},null,null,{"$f":"N67-N82","v":0}]
[]
[]
[]
[]
[]
[]
[]
[]
[]
[]
[]
[]
[]
[]
[null,null,null,null,null,null,null,null,null,null,null,null,null,null,null,null,null,null,"OK?"]

{"sheet":"GOEDGEKEURD INI BUDGET","index":3,"n_rows":80,"n_cols":14,"rows_kept":80,"cut":false,"hidden":true,"merged":[[53,4,53,5],[54,4,54,5],[55,4,55,5],[56,4,56,5],[57,4,57,5],[46,4,46,5],[49,4,49,5],[50,4,50,5],[51,4,51,5],[52,4,52,5],[41,4,41,5],[42,4,42,5],[43,4,43,5],[44,4,44,5],[45,4,45,5],[36,4,36,5],[37,4,37,5],[38,4,38,5],[39,4,39,5],[40,4,40,5],[50,2,50,3],[38,2,38,3],[39,2,39,3],[47,2,47,3],[42,2,42,3],[43,2,43,3],[48,2,48,3],[49,2,49,3],[40,2,40,3],[41,2,41,3],[44,2,44,3],[45,2,45,3],[46,2,46,3],[63,2,63,8],[56,2,56,3],[57,2,57,3],[59,2,59,3],[60,2,60,3],[59,4,59,5],[60,4,60,5],[58,2,58,3],[58,4,58,5],[77,2,77,8],[71,2,71,3],[72,2,72,3],[73,2,73,3],[74,2,74,3],[3,11,3,13],[7,4,7,13],[2,5,3,8],[7,2,7,3],[8,2,8,3],[8,4,8,13],[2,9,3,10],[9,4,9,13],[11,4,11,13],[10,4,10,13],[34,2,34,3],[9,2,9,3],[31,2,31,3],[32,2,32,3],[33,2,33,3],[10,2,10,3],[11,2,11,3],[15,2,15,3],[29,2,29,3],[27,2,27,3],[26,2,26,3],[30,2,30,3],[25,2,25,3],[28,2,28,3],[16,2,16,3],[79,5,79,8],[35,2,35,3],[36,2,36,3],[37,2,37,3],[70,2,70,3],[51,2,51,3],[52,2,52,3],[53,2,53,3],[54,2,54,3],[61,2,61,3],[55,2,55,3],[62,5,62,9],[75,2,75,3],[76,2,76,3]]}
[]
[]
[null,null,null,null,null,"GOEDGEKEURD INI BUDGET",null,null,null,"2021/XX"]
[null,null,null,null,null,null,null,null,null,null,null,"BUDGETAANVRAAG IF"]
[]
[]
[]
[null,null,{"$f":"BUDGETAANVRAAG!C8","v":"Datum aanvraag:"},null,{"$f":"BUDGETAANVRAAG!F8","v":"2020-09-11"}]
[null,null,"Begunstigde:",null,{"$f":"BUDGETAANVRAAG!F9","v":0}]
[null,null,"Project:",null,{"$f":"BUDGETAANVRAAG!F10","v":0}]
[null,null,"Contactpersoon",null,{"$f":"BUDGETAANVRAAG!F11","v":0}]
[null,null,"Looptijd project (aantal maanden):",null,{"$f":"BUDGETAANVRAAG!F12","v":0}]
[]
[]
[]
[null,null,{"$f":"BUDGETAANVRAAG!C16","v":"Budget 2021"},null,"VTE","Eenheidskost (per maand)","Eenheidskost (per jaar)","Aantal maanden project","% van de tijd aan het project","Totaal bedrag project","Akkoord Fedasil INI BUDGET (project of activiteit)","% Fedasil","Andere financierings-bronnen","% andere bronnen"]
[null,null,"Personeel",null,"(stap1)","(stap2)",null,"(stap3)","(stap4)",null,"(stap5)"]
[null,null,{"$f":"BUDGETAANVRAAG!C18","v":"(naam in te vullen)"},{"$f":"BUDGETAANVRAAG!D18","v":"(functie in te vullen)"},{"$f":"BUDGETAANVRAAG!F18","v":0},{"$f":"BUDGETAANVRAAG!G18","v":0},{"$f":"F18*12","v":0},{"$f":"BUDGETAANVRAAG!I18","v":0},{"$f":"BUDGETAANVRAAG!J18","v":0},{"$f":"I18*H18*F18","v":0},{"$f":"BUDGETAANVRAAG!L18","v":0},{"$f":"IF(J18=0,0,K18/J18)","v":0},{"$f":"J18-K18","v":0},{"$f":"IF(J18=0,0,M18/J18)","v":0}]
[null,null,{"$f":"BUDGETAANVRAAG!C19","v":"(naam in te vullen)"},{"$f":"BUDGETAANVRAAG!D19","v":"(functie in te vullen)"},{"$f":"BUDGETAANVRAAG!F19","v":0},{"$f":"BUDGETAANVRAAG!G19","v":0},{"$f":"F19*12","v":0},{"$f":"BUDGETAANVRAAG!I19","v":0},{"$f":"BUDGETAANVRAAG!J19","v":0},0,{"$f":"BUDGETAANVRAAG!L19","v":0},{"$f":"IF(J19=0,0,K19/J19)","v":0},{"$f":"J19-K19","v":0},{"$f":"IF(J19=0,0,M19/J19)","v":0}]
[null,null,{"$f":"BUDGETAANVRAAG!C20","v":"(naam in te vullen)"},{"$f":"BUDGETAANVRAAG!D20","v":"(functie in te vullen)"},{"$f":"BUDGETAANVRAAG!F20","v":0},{"$f":"BUDGETAANVRAAG!G20","v":0},0,{"$f":"BUDGETAANVRAAG!I20","v":0},{"$f":"BUDGETAANVRAAG!J20","v":0},0,{"$f":"BUDGETAANVRAAG!L20","v":0},{"$f":"IF(J20=0,0,K20/J20)","v":0},0,{"$f":"IF(J20=0,0,M20/J20)","v":0}]
[null,null,{"$f":"BUDGETAANVRAAG!C21","v":"(naam in te vullen)"},{"$f":"BUDGETAANVRAAG!D21","v":"(functie in te vullen)"},{"$f":"BUDGETAANVRAAG!F21","v":0},{"$f":"BUDGETAANVRAAG!G21","v":0},0,{"$f":"BUDGETAANVRAAG!I21","v":0},{"$f":"BUDGETAANVRAAG!J21","v":0},0,{"$f":"BUDGETAANVRAAG!L21","v":0},0,0,0]
[null,null,{"$f":"BUDGETAANVRAAG!C22","v":"(naam in te vullen)"},{"$f":"BUDGETAANVRAAG!D22","v":"(functie in te vullen)"},{"$f":"BUDGETAANVRAAG!F22","v":0},{"$f":"BUDGETAANVRAAG!G22","v":0},0,{"$f":"BUDGETAANVRAAG!I22","v":0},{"$f":"BUDGETAANVRAAG!J22","v":0},0,{"$f":"BUDGETAANVRAAG!L22","v":0},0,0,0]
[null,null,{"$f":"BUDGETAANVRAAG!C23","v":"(naam in te vullen)"},{"$f":"BUDGETAANVRAAG!D23","v":"(functie in te vullen)"},{"$f":"BUDGETAANVRAAG!F23","v":0},{"$f":"BUDGETAANVRAAG!G23","v":0},0,{"$f":"BUDGETAANVRAAG!I23","v":0},{"$f":"BUDGETAANVRAAG!J23","v":0},0,{"$f":"BUDGETAANVRAAG!L23","v":0},0,0,0]
[null,null,{"$f":"BUDGETAANVRAAG!C24","v":"(naam in te vullen)"},{"$f":"BUDGETAANVRAAG!D24","v":"(functie in te vullen)"},{"$f":"BUDGETAANVRAAG!F24","v":0},{"$f":"BUDGETAANVRAAG!G24","v":0},0,{"$f":"BUDGETAANVRAAG!I24","v":0},{"$f":"BUDGETAANVRAAG!J24","v":0},0,{"$f":"BUDGETAANVRAAG!L24","v":0},0,0,0]
[null,null,{"$f":"BUDGETAANVRAAG!C25","v":"(naam in te vullen)"},{"$f":"BUDGETAANVRAAG!D25","v":"(functie in te vullen)"},{"$f":"BUDGETAANVRAAG!F25","v":0},{"$f":"BUDGETAANVRAAG!G25","v":0},{"$f":"F25*12","v":0},{"$f":"BUDGETAANVRAAG!I25","v":0},{"$f":"BUDGETAANVRAAG!J25","v":0},0,{"$f":"BUDGETAANVRAAG!L25","v":0},0,0,0]
[null,null,"Totaal",null,{"$f":"SUM(E18:E25)","v":0},null,{"$f":"SUM(G18:G25)","v":0},null,null,{"$f":"SUM(J18:J25)","v":0},{"$f":"SUM(K18:K25)","v":0},{"$f":"IF(J26=0,0,K26/J26)","v":0},{"$f":"SUM(M18:M25)","v":0},{"$f":"IF(J26=0,0,M26/J26)","v":0}]
[null,null,"Huur"]
[null,null,{"$f":"BUDGETAANVRAAG!C28","v":"(Voorwerp/Gebouw & Adres in te vullen)"},null,null,{"$f":"BUDGETAANVRAAG!G28","v":0},{"$f":"+F28*12","v":0},{"$f":"BUDGETAANVRAAG!I28","v":0},{"$f":"BUDGETAANVRAAG!J28","v":0},{"$f":"I28*H28*F28","v":0},{"$f":"BUDGETAANVRAAG!L28","v":0},0,{"$f":"J28-K28","v":0},0]
[null,null,"Totaal",null,null,null,{"$f":"SUM(G28:G28)","v":0},null,null,{"$f":"SUM(J28:J28)","v":0},{"$f":"SUM(K28:K28)","v":0},{"$f":"IF(J29=0,0,K29/J29)","v":0},{"$f":"SUM(M28:M28)","v":0},{"$f":"IF(J29=0,0,M29/J29)","v":0}]
[null,null,"Investeringen (vb. hard-en/of software) "]
[null,null,{"$f":"BUDGETAANVRAAG!C32","v":"(Beschrijving in te vullen)"},null,null,null,{"$f":"BUDGETAANVRAAG!H32","v":0},null,{"$f":"BUDGETAANVRAAG!J32","v":0},{"$f":"G31*I31","v":0},{"$f":"BUDGETAANVRAAG!L32","v":0},0,{"$f":"J31-K31","v":0},0]
[null,null,{"$f":"BUDGETAANVRAAG!C33","v":"(in te vullen)"},null,null,null,{"$f":"BUDGETAANVRAAG!H33","v":0},null,{"$f":"BUDGETAANVRAAG!J33","v":0},{"$f":"G32*I32","v":0},{"$f":"BUDGETAANVRAAG!L33","v":0},0,{"$f":"J32-K32","v":0},0]
[null,null,{"$f":"BUDGETAANVRAAG!C34","v":"(in te vullen)"},null,null,null,{"$f":"BUDGETAANVRAAG!H34","v":0},null,{"$f":"BUDGETAANVRAAG!J34","v":0},{"$f":"G33*I33","v":0},{"$f":"BUDGETAANVRAAG!L34","v":0},0,{"$f":"J33-K33","v":0},0]
[null,null,{"$f":"BUDGETAANVRAAG!C35","v":"(in te vullen)"},null,null,null,{"$f":"BUDGETAANVRAAG!H35","v":0},null,{"$f":"BUDGETAANVRAAG!J35","v":0},{"$f":"G34*I34","v":0},{"$f":"BUDGETAANVRAAG!L35","v":0},0,{"$f":"J34-K34","v":0},0]
[null,null,"Totaal",null,null,null,{"$f":"SUM(G31:G34)","v":0},null,null,{"$f":"SUM(J31:J34)","v":0},{"$f":"SUM(K31:K34)","v":0},0,{"$f":"SUM(M31:M34)","v":0},0]
[null,null,"Directe werkingskosten**"]
[null,null,{"$f":"BUDGETAANVRAAG!C39","v":"Kies uit lijst Directe Werkingskosten"},null,{"$f":"BUDGETAANVRAAG!F39","v":" "},null,{"$f":"BUDGETAANVRAAG!H39","v":0},null,null,{"$f":"G37","v":0},{"$f":"BUDGETAANVRAAG!L39","v":0},0,{"$f":"J37-K37","v":0},0]
[null,null,{"$f":"BUDGETAANVRAAG!C40","v":"Kies uit lijst Directe Werkingskosten"},null,{"$f":"BUDGETAANVRAAG!F40","v":" "},null,{"$f":"BUDGETAANVRAAG!H40","v":0},null,null,{"$f":"G38","v":0},{"$f":"BUDGETAANVRAAG!L40","v":0},0,{"$f":"J38-K38","v":0},0]
[null,null,{"$f":"BUDGETAANVRAAG!C41","v":"Kies uit lijst Directe Werkingskosten"},null,{"$f":"BUDGETAANVRAAG!F41","v":" "},null,{"$f":"BUDGETAANVRAAG!H41","v":0},null,null,0,{"$f":"BUDGETAANVRAAG!L41","v":0},0,0,0]
[null,null,{"$f":"BUDGETAANVRAAG!C42","v":"Kies uit lijst Directe Werkingskosten"},null,{"$f":"BUDGETAANVRAAG!F42","v":" "},null,{"$f":"BUDGETAANVRAAG!H42","v":0},null,null,0,{"$f":"BUDGETAANVRAAG!L42","v":0},0,0,0]
[null,null,{"$f":"BUDGETAANVRAAG!C43","v":"Kies uit lijst Directe Werkingskosten"},null,{"$f":"BUDGETAANVRAAG!F43","v":" "},null,{"$f":"BUDGETAANVRAAG!H43","v":0},null,null,0,{"$f":"BUDGETAANVRAAG!L43","v":0},0,0,0]
[null,null,{"$f":"BUDGETAANVRAAG!C44","v":"Kies uit lijst Directe Werkingskosten"},null,{"$f":"BUDGETAANVRAAG!F44","v":" "},null,{"$f":"BUDGETAANVRAAG!H44","v":0},null,null,0,{"$f":"BUDGETAANVRAAG!L44","v":0},0,{"$f":"J42-K42","v":0},0]
[null,null,{"$f":"BUDGETAANVRAAG!C45","v":"Kies uit lijst Directe Werkingskosten"},null,{"$f":"BUDGETAANVRAAG!F45","v":" "},null,{"$f":"BUDGETAANVRAAG!H45","v":0},null,null,0,{"$f":"BUDGETAANVRAAG!L45","v":0},0,{"$f":"J43-K43","v":0},0]
[null,null,{"$f":"BUDGETAANVRAAG!C46","v":"Kies uit lijst Directe Werkingskosten"},null,{"$f":"BUDGETAANVRAAG!F46","v":" "},null,{"$f":"BUDGETAANVRAAG!H46","v":0},null,null,0,{"$f":"BUDGETAANVRAAG!L46","v":0},0,{"$f":"J44-K44","v":0},0]
[null,null,{"$f":"BUDGETAANVRAAG!C47","v":"Kies uit lijst Directe Werkingskosten"},null,{"$f":"BUDGETAANVRAAG!F47","v":" "},null,{"$f":"BUDGETAANVRAAG!H47","v":0},null,null,0,{"$f":"BUDGETAANVRAAG!L47","v":0},0,{"$f":"J45-K45","v":0},0]
[null,null,{"$f":"BUDGETAANVRAAG!C48","v":"Andere: (zelf in te vullen)"},null,{"$f":"BUDGETAANVRAAG!F48","v":" "},null,{"$f":"BUDGETAANVRAAG!H48","v":0},null,null,0,{"$f":"BUDGETAANVRAAG!L48","v":0},0,{"$f":"J46-K46","v":0},0]
[null,null,{"$f":"BUDGETAANVRAAG!C49","v":"Andere: (zelf in te vullen)"},null,{"$f":"BUDGETAANVRAAG!F49","v":" "},null,{"$f":"BUDGETAANVRAAG!H49","v":0},null,null,0,{"$f":"BUDGETAANVRAAG!L49","v":0},0,0,0]
[null,null,"Totaal",null,null,null,{"$f":"SUM(G37:G47)","v":0},null,null,{"$f":"SUM(J37:J47)","v":0},{"$f":"SUM(K37:K47)","v":0},{"$f":"IF(J48=0,0,K48/J48)","v":0},{"$f":"SUM(M37:M47)","v":0},0]
[null,null,"Indirecte werkingskosten***"]
[null,null,{"$f":"BUDGETAANVRAAG!C53","v":"Kies uit lijst Indirecte Werkingskosten"},null,null,null,{"$f":"BUDGETAANVRAAG!H53","v":0},null,{"$f":"BUDGETAANVRAAG!J53","v":0},{"$f":"G50*I50","v":0},{"$f":"BUDGETAANVRAAG!L53","v":0},0,{"$f":"J50-K50","v":0},0]
[null,null,{"$f":"BUDGETAANVRAAG!C54","v":"Kies uit lijst Indirecte Werkingskosten"},null,null,null,{"$f":"BUDGETAANVRAAG!H54","v":0},null,{"$f":"BUDGETAANVRAAG!J54","v":0},{"$f":"G51*I51","v":0},{"$f":"BUDGETAANVRAAG!L54","v":0},0,{"$f":"J51-K51","v":0},0]
[null,null,{"$f":"BUDGETAANVRAAG!C55","v":"Kies uit lijst Indirecte Werkingskosten"},null,null,null,{"$f":"BUDGETAANVRAAG!H55","v":0},null,{"$f":"BUDGETAANVRAAG!J55","v":0},0,{"$f":"BUDGETAANVRAAG!L55","v":0},0,0,0]
[null,null,{"$f":"BUDGETAANVRAAG!C56","v":"Kies uit lijst Indirecte Werkingskosten"},null,null,null,{"$f":"BUDGETAANVRAAG!H56","v":0},null,{"$f":"BUDGETAANVRAAG!J56","v":0},0,{"$f":"BUDGETAANVRAAG!L56","v":0},0,0,0]
[null,null,{"$f":"BUDGETAANVRAAG!C57","v":"Kies uit lijst Indirecte Werkingskosten"},null,null,null,{"$f":"BUDGETAANVRAAG!H57","v":0},null,{"$f":"BUDGETAANVRAAG!J57","v":0},{"$f":"G54*I54","v":0},{"$f":"BUDGETAANVRAAG!L57","v":0},0,{"$f":"J54-K54","v":0},0]
[null,null,{"$f":"BUDGETAANVRAAG!C58","v":"Kies uit lijst Indirecte Werkingskosten"},null,null,null,{"$f":"BUDGETAANVRAAG!H58","v":0},null,{"$f":"BUDGETAANVRAAG!J58","v":0},{"$f":"G55*I55","v":0},{"$f":"BUDGETAANVRAAG!L58","v":0},0,{"$f":"J55-K55","v":0},0]
[null,null,{"$f":"BUDGETAANVRAAG!C59","v":"Kies uit lijst Indirecte Werkingskosten"},null,null,null,{"$f":"BUDGETAANVRAAG!H59","v":0},null,{"$f":"BUDGETAANVRAAG!J59","v":0},0,{"$f":"BUDGETAANVRAAG!L59","v":0},0,0,0]
[null,null,{"$f":"BUDGETAANVRAAG!C60","v":"Kies uit lijst Indirecte Werkingskosten"},null,null,null,{"$f":"BUDGETAANVRAAG!H60","v":0},null,{"$f":"BUDGETAANVRAAG!J60","v":0},0,{"$f":"BUDGETAANVRAAG!L60","v":0},0,0,0]
[null,null,{"$f":"BUDGETAANVRAAG!C61","v":"Kies uit lijst Indirecte Werkingskosten"},null,null,null,{"$f":"BUDGETAANVRAAG!H61","v":0},null,{"$f":"BUDGETAANVRAAG!J61","v":0},0,{"$f":"BUDGETAANVRAAG!L61","v":0},0,0,0]
[null,null,{"$f":"BUDGETAANVRAAG!C62","v":"Kies uit lijst Indirecte Werkingskosten"},null,null,null,{"$f":"BUDGETAANVRAAG!H62","v":0},null,{"$f":"BUDGETAANVRAAG!J62","v":0},{"$f":"G59*I59","v":0},{"$f":"BUDGETAANVRAAG!L62","v":0},{"$f":"IF(J59=0,0,K59/J59)","v":0},{"$f":"J59-K59","v":0},{"$f":"IF(J59=0,0,M59/J59)","v":0}]
[null,null,{"$f":"BUDGETAANVRAAG!C63","v":"Andere: (zelf in te vullen)"},null,{"$f":"BUDGETAANVRAAG!F63","v":0},null,{"$f":"BUDGETAANVRAAG!H63","v":0},null,{"$f":"BUDGETAANVRAAG!J63","v":0},0,{"$f":"BUDGETAANVRAAG!L63","v":0},0,0,0]
[null,null,{"$f":"BUDGETAANVRAAG!C64","v":"Andere: (zelf in te vullen)"},null,{"$f":"BUDGETAANVRAAG!F64","v":0},null,{"$f":"BUDGETAANVRAAG!H64","v":0},null,{"$f":"BUDGETAANVRAAG!J64","v":0},0,{"$f":"BUDGETAANVRAAG!L64","v":0},0,0,0]
[null,null,"Totaal",null,null,null,{"$f":"SUM(G50:G61)","v":0},null,null,{"$f":"SUM(J50:J61)","v":0},{"$f":"SUM(K50:K61)","v":0},{"$f":"IF(J62=0,0,K62/J62)","v":0},{"$f":"SUM(M50:M61)","v":0},{"$f":"IF(J62=0,0,M62/J62)","v":0}]
[null,null,null,null,null,"MAX TOEGELATEN INDIRECTE KOSTEN ****:",null,null,null,null,{"$f":"(K26+K29+K35+K48)*0.07","v":0}]
[null,null,"TOTAAL",null,null,null,null,null,null,{"$f":"J62+J48+J35+J29+J26","v":0},{"$f":"K62+K48+K35+K29+K26","v":0},0,{"$f":"M62+M48+M35+M29+M26","v":0},0]
[null,null,"* Indien een gedeelte of het geheel van de subsidie als co-financiering wordt aangewend, moet de verdeling hier worden aangeduid. Gelieve, per project, een kolom toe te voegen."]
[null,null,"** Directe werkingskosten: Het gaat om kosten die boekhoudkundig aan het project of activiteit worden toegewezen. Indien niet mogelijk kunnen deze kosten worden gecategoriseerd als 'andere werkingskosten'. "]
[null,null,"*** Indirecte werkingskosten:'Het gaat om kosten die boekhoudkundig niet volledig aan het project of activiteit kunnen worden toegewezen. Deze kost wordt via een verdeelsleutel toegewezen. "]
[null,null,"     De gehanteerde verdeelsleutel moet verklaard worden in het inhoudelijk verslag. "]
[null,null,"**** max toegelaten indirecte kosten: 7% van de som van personeel, huur, investeringen en directe werkingskosten"]
[]
[null,null,"Financiering",null,null,null,"Zekerheid",null,null,"Totaal bedrag project","Akkoord Fedasil INI BUDGET (project of activiteit)","% Fedasil","Andere financierings-bronnen","% andere bronnen"]
[null,null,{"$f":"BUDGETAANVRAAG!C76","v":"Fedasil"},null,null,null,{"$f":"BUDGETAANVRAAG!H76","v":"Aangevraagd"},null,null,{"$f":"K72","v":0},{"$f":"K64","v":0},{"$f":"IF($J$64=0,0,K72/$J$64)","v":0}]
[null,null,{"$f":"BUDGETAANVRAAG!C77","v":"Eigen middelen"},null,null,null,{"$f":"BUDGETAANVRAAG!H77","v":"(in te vullen)"},null,null,{"$f":"M73","v":0},null,null,{"$f":"BUDGETAANVRAAG!N77","v":0},{"$f":"IF($J$64=0,0,M73/$J$64)","v":0}]
[null,null,{"$f":"BUDGETAANVRAAG!C78","v":"Andere: (zelf in te vullen)"},null,null,null,{"$f":"BUDGETAANVRAAG!H78","v":"(in te vullen)"},null,null,0,null,null,{"$f":"BUDGETAANVRAAG!N78","v":0},0]
[null,null,{"$f":"BUDGETAANVRAAG!C79","v":"Andere: (zelf in te vullen)"},null,null,null,{"$f":"BUDGETAANVRAAG!H79","v":"(in te vullen)"},null,null,0,null,null,{"$f":"BUDGETAANVRAAG!N79","v":0},0]
[null,null,{"$f":"BUDGETAANVRAAG!C80","v":"Andere: (zelf in te vullen)"},null,null,null,{"$f":"BUDGETAANVRAAG!H80","v":"(in te vullen)"},null,null,{"$f":"M76","v":0},null,null,{"$f":"BUDGETAANVRAAG!N80","v":0},0]
[null,null,{"$f":"BUDGETAANVRAAG!C81","v":"Andere: (zelf in te vullen)"},null,null,null,{"$f":"BUDGETAANVRAAG!H81","v":"(in te vullen)"},null,null,0,null,null,{"$f":"BUDGETAANVRAAG!N81","v":0},0]
[null,null,"TOTAAL",null,null,null,null,null,null,{"$f":"SUM(J72:J77)","v":0},{"$f":"SUM(K72:K77)","v":0},{"$f":"IF($J$64=0,0,K78/$J$64)","v":0},{"$f":"SUM(M73:M77)","v":0},{"$f":"IF($J$64=0,0,M78/$J$64)","v":0}]
[]
[null,null,null,null,null,"VERSCHIL TUSSEN BUDGET EN FINANCIERING",null,null,null,{"$f":"J64-J78","v":0},null,null,{"$f":"M64-M78","v":0}]

{"sheet":"INSTRUCTIE BUDGETWIJZIGING","index":4,"n_rows":35,"n_cols":1,"rows_kept":35,"cut":false,"hidden":true,"merged":[[18,0,21,0]]}
["INSTRUCTIE BUDGETWIJZIGING"]
[]
["BUDGETAANVRAAG BIJ NIEUW PROJECT OF PROJECTVERLENGING"]
["TIMING INDIENING"]
["Ten laatste [xx] augustus bij projectverlenging of [xx] december voor een nieuw project in het jaar vóór start projectjaar"]
[]
["FORMAT DOCUMENTEN"]
["elektronische versie + gedrukte versie in één exemplaar"]
[]
["WELKE DOCUMENTEN"]
[" 1)  dit excel document die de volgende informatie moet bevatten: "]
["* budgetaanvraag per kostensoort gefinancieerd door Fedasil en/of andere financieringsbronnen"]
[" 2) het financieel onderdeel van het inhoudelijke verslag "]
[]
["BUDGETWIJZIGING TIJDENS DE LOOP VAN HET JAAR"]
["OVERDRACHT TUSSEN RUBRIEKEN<10%"]
["De begunstigde kan bij de uitvoering van het project de begroting aanpassen door overdrachten tussen rubrieken, mits deze aanpassing de uitvoering van het project niet in de weg staat en het bedrag van de overdracht tussen rubrieken niet meer bedraagt dan 10% van het bedrag van elke rubriek van het budget, en zonder dat dit het vermelde bedrag aan totale subsidiabele kosten wijzigt. Zij stellen het Agentschap hiervan schriftelijk in kennis. "]
["OVERDRACHT TUSSEN RUBRIEKEN>10%"]
["Overdrachten tussen rubrieken van meer dan 10% zijn uitzonderlijk aanvaardbaar mits deze aanpassing de uitvoering van het project niet in de weg staat en zonder dat dit het vermelde bedrag aan totale subsidiabele kosten wijzigt. \nDe begunstigde dient voorafgaandelijk het akkoord van het Agentschap te vragen aan de hand van een verzoek tot budgetwijziging, dat bestaat uit een vergelijking van het aangepast budget met het initieel budget en een uitgebreide argumentatie voor alle aanpassingen. \nDeze schriftelijke kennisgevingen en aanvragen tot budgetwijzigingen dienen steeds te gebeuren 1 maand voor het einde van de overeenkomst.\n\n"]
[]
[]
[]
[]
["TAB BUDGETWIJZIGING"]
["Het budgetwijzigingsdocument is reeds ingevuld aan de hand van het initieel goedgekeurd budget. "]
["Gelieve enkel de bedragen te wijzigen in de kolom \"Budgetwijziging Fedasil (project of activiteit)\" dmv - bedrag verminderd van het INI bedrag \nen + bedrag vermeerderd bij het INI bedrag"]
[]
[]
["WAT WENST U NU TE DOEN?"]
["← klik op button"]
["← klik op button"]
["← klik op button"]
["← klik op button"]
[]
["WAT WENST U NU TE DOEN?"]

{"sheet":"AANVRAAG BUDGET AJU","index":5,"n_rows":146,"n_cols":20,"rows_kept":146,"cut":false,"hidden":true,"merged":[[15,17,15,19],[63,2,63,3],[64,2,64,4],[65,2,65,4],[67,2,67,9],[57,2,57,3],[58,2,58,3],[59,2,59,3],[60,2,60,3],[61,2,61,3],[66,6,66,10],[58,5,58,6],[59,5,59,6],[60,5,60,6],[61,5,61,6],[63,5,63,6],[64,5,64,6],[62,2,62,3],[62,5,62,6],[41,2,41,3],[42,2,42,3],[43,2,43,3],[44,2,44,3],[45,2,45,3],[53,2,53,3],[54,2,54,3],[55,2,55,3],[56,2,56,3],[46,2,46,3],[47,2,47,3],[48,2,48,3],[49,2,49,4],[50,2,50,4],[51,2,51,4],[52,2,52,4],[22,3,22,4],[36,2,36,4],[39,2,39,3],[40,2,40,3],[29,2,29,4],[30,2,30,4],[31,2,31,4],[38,2,38,4],[37,2,37,4],[32,2,32,4],[33,2,33,4],[34,2,34,4],[35,2,35,4],[146,2,155,10],[146,11,155,17],[146,18,155,18],[124,2,133,10],[124,11,133,17],[124,18,133,18],[135,2,144,10],[135,11,144,17],[135,18,144,18],[134,2,134,3],[134,5,134,10],[134,11,134,12],[134,14,134,18],[145,2,145,3],[145,5,145,10],[145,11,145,12],[145,14,145,18],[113,11,122,17],[112,5,112,10],[3,12,3,14],[99,18,100,18],[81,2,81,9],[76,2,76,3],[77,2,77,3],[78,2,78,3],[79,2,79,3],[7,2,7,4],[8,2,8,4],[9,2,9,4],[23,3,23,4],[24,3,24,4],[25,3,25,4],[26,2,26,4],[28,2,28,4],[10,2,10,4],[16,2,16,4],[11,2,11,4],[18,3,18,4],[19,3,19,4],[20,3,20,4],[21,3,21,4],[123,2,123,3],[123,5,123,10],[123,11,123,12],[123,14,123,18],[49,5,49,6],[53,5,53,6],[54,5,54,6],[55,5,55,6],[56,5,56,6],[57,5,57,6],[83,6,83,9],[99,11,100,17],[113,18,122,18],[99,2,100,10],[74,2,74,4],[75,2,75,4],[80,2,80,4],[101,2,101,3],[101,5,101,10],[112,2,112,3],[102,2,111,10],[102,11,111,17],[102,18,111,18],[113,2,122,10],[7,5,7,16],[8,5,8,16],[9,5,9,16],[10,5,10,16],[11,6,11,16],[12,5,12,16],[13,5,13,16],[14,5,14,16],[48,5,48,6],[39,5,39,6],[40,5,40,6],[41,5,41,6],[42,5,42,6],[43,5,43,6],[44,5,44,6],[45,5,45,6],[46,5,46,6],[47,5,47,6],[15,5,15,16]]}
[]
[]
[]
[null,null,null,null,null,null,null,null,null,null,null,null,"AANVRAAG BUDGET AJU"]
[]
[]
[]
[null,null,{"$f":"'GOEDGEKEURD INI BUDGET'!C8","v":"Datum aanvraag:"},null,null,{"$f":"TODAY()","v":"2020-09-11"}]
[null,null,"Begunstigde:",null,null,{"$f":"'GOEDGEKEURD INI BUDGET'!E9","v":0}]
[null,null,"Project:",null,null,{"$f":"'GOEDGEKEURD INI BUDGET'!E10","v":0}]
[null,null,"Contactpersoon",null,null,{"$f":"'GOEDGEKEURD INI BUDGET'!E11","v":0}]
[null,null,"Looptijd project (aantal maanden):",null,null,{"$f":"'GOEDGEKEURD INI BUDGET'!E12","v":0},{"$f":"IF(OR(F12=0,F12>=13),\"Gelieve een correcte looptijd in te geven\",\" \")","v":"Gelieve een correcte looptijd in te geven"}]
[null,null,null,null,null,"INSTRUCTIE"]
[null,null,null,null,null,"OPGELET! We aanvaarden enkel wijzigingen met argumentatie "]
[null,null,null,null,null,"link argumentatie"]
[null,null,null,null,null,"!!!!! BLAUWE CELLEN niet INVULLEN !!!!",null,null,null,null,null,null,null,null,null,null,null,"BEVESTIGEN"]
[null,null,{"$f":"'GOEDGEKEURD INI BUDGET'!C16","v":"Budget 2021"},null,null,"VTE","Eenheidskost (per maand)","Eenheidskost (per jaar)","Aantal maanden project","% van de tijd aan het project","Totaal bedrag project","Subsidievraag Fedasil (project of activiteit)","% Fedasil","Andere financierings-bronnen","% andere bronnen","Budgetwijziging Fedasil (project of activiteit)","Totaal AJU Fedasil financiering","Totaal bedrag project na budgetwijziging","Totaal AJU Fedasil financiering","Andere financierings-bronnen na budgetwijziging"]
[null,null,"Personeel","link naar argumentatie",null,"(stap1)","(stap2)",null,"(stap3)","(stap4)",null,"(stap5)"]
[null,null,{"$f":"'GOEDGEKEURD INI BUDGET'!C18","v":"(naam in te vullen)"},{"$f":"'GOEDGEKEURD INI BUDGET'!D18","v":"(functie in te vullen)"},null,{"$f":"'GOEDGEKEURD INI BUDGET'!E18","v":0},{"$f":"'GOEDGEKEURD INI BUDGET'!F18","v":0},{"$f":"G19*12","v":0},{"$f":"'GOEDGEKEURD INI BUDGET'!H18","v":0},{"$f":"'GOEDGEKEURD INI BUDGET'!I18","v":0},{"$f":"J19*I19*G19","v":0},{"$f":"'GOEDGEKEURD INI BUDGET'!K18","v":0},{"$f":"IF(K19=0,0,L19/K19)","v":0},{"$f":"'GOEDGEKEURD INI BUDGET'!M18","v":0},{"$f":"IF(K19=0,0,N19/K19)","v":0},0,{"$f":"IF(P19=0,L19,P19+L19)","v":0},{"$f":"K19+P19","v":0},{"$f":"Q19","v":0},{"$f":"R19-Q19","v":0}]
[null,null,{"$f":"'GOEDGEKEURD INI BUDGET'!C19","v":"(naam in te vullen)"},{"$f":"'GOEDGEKEURD INI BUDGET'!D19","v":"(functie in te vullen)"},null,{"$f":"'GOEDGEKEURD INI BUDGET'!E19","v":0},{"$f":"'GOEDGEKEURD INI BUDGET'!F19","v":0},0,{"$f":"'GOEDGEKEURD INI BUDGET'!H19","v":0},{"$f":"'GOEDGEKEURD INI BUDGET'!I19","v":0},0,{"$f":"'GOEDGEKEURD INI BUDGET'!K19","v":0},{"$f":"IF(K20=0,0,L20/K20)","v":0},{"$f":"'GOEDGEKEURD INI BUDGET'!M19","v":0},{"$f":"IF(K20=0,0,N20/K20)","v":0},0,{"$f":"IF(P20=0,L20,P20+L20)","v":0},{"$f":"K20+P20","v":0},{"$f":"Q20","v":0},{"$f":"R20-Q20","v":0}]
[null,null,{"$f":"'GOEDGEKEURD INI BUDGET'!C20","v":"(naam in te vullen)"},{"$f":"'GOEDGEKEURD INI BUDGET'!D20","v":"(functie in te vullen)"},null,{"$f":"'GOEDGEKEURD INI BUDGET'!E20","v":0},{"$f":"'GOEDGEKEURD INI BUDGET'!F20","v":0},0,{"$f":"'GOEDGEKEURD INI BUDGET'!H20","v":0},{"$f":"'GOEDGEKEURD INI BUDGET'!I20","v":0},0,{"$f":"'GOEDGEKEURD INI BUDGET'!K20","v":0},{"$f":"IF(K21=0,0,L21/K21)","v":0},{"$f":"'GOEDGEKEURD INI BUDGET'!M20","v":0},{"$f":"IF(K21=0,0,N21/K21)","v":0},0,0,0,0,0]
[null,null,{"$f":"'GOEDGEKEURD INI BUDGET'!C21","v":"(naam in te vullen)"},{"$f":"'GOEDGEKEURD INI BUDGET'!D21","v":"(functie in te vullen)"},null,{"$f":"'GOEDGEKEURD INI BUDGET'!E21","v":0},{"$f":"'GOEDGEKEURD INI BUDGET'!F21","v":0},0,{"$f":"'GOEDGEKEURD INI BUDGET'!H21","v":0},{"$f":"'GOEDGEKEURD INI BUDGET'!I21","v":0},0,{"$f":"'GOEDGEKEURD INI BUDGET'!K21","v":0},0,{"$f":"'GOEDGEKEURD INI BUDGET'!M21","v":0},0,0,0,0,0,0]
[null,null,{"$f":"'GOEDGEKEURD INI BUDGET'!C22","v":"(naam in te vullen)"},{"$f":"'GOEDGEKEURD INI BUDGET'!D22","v":"(functie in te vullen)"},null,{"$f":"'GOEDGEKEURD INI BUDGET'!E22","v":0},{"$f":"'GOEDGEKEURD INI BUDGET'!F22","v":0},0,{"$f":"'GOEDGEKEURD INI BUDGET'!H22","v":0},{"$f":"'GOEDGEKEURD INI BUDGET'!I22","v":0},0,{"$f":"'GOEDGEKEURD INI BUDGET'!K22","v":0},0,{"$f":"'GOEDGEKEURD INI BUDGET'!M22","v":0},0,0,0,0,0,0]
[null,null,{"$f":"'GOEDGEKEURD INI BUDGET'!C23","v":"(naam in te vullen)"},{"$f":"'GOEDGEKEURD INI BUDGET'!D23","v":"(functie in te vullen)"},null,{"$f":"'GOEDGEKEURD INI BUDGET'!E23","v":0},{"$f":"'GOEDGEKEURD INI BUDGET'!F23","v":0},0,{"$f":"'GOEDGEKEURD INI BUDGET'!H23","v":0},{"$f":"'GOEDGEKEURD INI BUDGET'!I23","v":0},0,{"$f":"'GOEDGEKEURD INI BUDGET'!K23","v":0},0,{"$f":"'GOEDGEKEURD INI BUDGET'!M23","v":0},0,0,0,0,0,0]
[null,null,{"$f":"'GOEDGEKEURD INI BUDGET'!C24","v":"(naam in te vullen)"},{"$f":"'GOEDGEKEURD INI BUDGET'!D24","v":"(functie in te vullen)"},null,{"$f":"'GOEDGEKEURD INI BUDGET'!E24","v":0},{"$f":"'GOEDGEKEURD INI BUDGET'!F24","v":0},0,{"$f":"'GOEDGEKEURD INI BUDGET'!H24","v":0},{"$f":"'GOEDGEKEURD INI BUDGET'!I24","v":0},0,{"$f":"'GOEDGEKEURD INI BUDGET'!K24","v":0},0,{"$f":"'GOEDGEKEURD INI BUDGET'!M24","v":0},0,0,0,0,0,0]
[null,null,{"$f":"'GOEDGEKEURD INI BUDGET'!C25","v":"(naam in te vullen)"},{"$f":"'GOEDGEKEURD INI BUDGET'!D25","v":"(functie in te vullen)"},null,{"$f":"'GOEDGEKEURD INI BUDGET'!E25","v":0},{"$f":"'GOEDGEKEURD INI BUDGET'!F25","v":0},0,{"$f":"'GOEDGEKEURD INI BUDGET'!H25","v":0},{"$f":"'GOEDGEKEURD INI BUDGET'!I25","v":0},0,{"$f":"'GOEDGEKEURD INI BUDGET'!K25","v":0},0,{"$f":"'GOEDGEKEURD INI BUDGET'!M25","v":0},0,0,0,0,0,0]
[null,null,"Totaal",null,null,{"$f":"SUM(F19:F26)","v":0},null,{"$f":"SUM(H19:H26)","v":0},null,null,{"$f":"SUM(K19:K26)","v":0},{"$f":"SUM(L19:L26)","v":0},{"$f":"IF(K27=0,0,L27/K27)","v":0},{"$f":"SUM(N19:N26)","v":0},{"$f":"IF(K27=0,0,N27/K27)","v":0},{"$f":"SUM(P19:P26)","v":0},{"$f":"SUM(Q19:Q26)","v":0},{"$f":"SUM(R19:R26)","v":0},{"$f":"SUM(S19:S26)","v":0},{"$f":"SUM(T19:T26)","v":0}]
[null,null,"Huur","link naar argumentatie"]
[null,null,{"$f":"'GOEDGEKEURD INI BUDGET'!C28","v":"(Voorwerp/Gebouw & Adres in te vullen)"},null,null,null,{"$f":"'GOEDGEKEURD INI BUDGET'!F28","v":0},{"$f":"G29*12","v":0},{"$f":"'GOEDGEKEURD INI BUDGET'!H28","v":0},{"$f":"'GOEDGEKEURD INI BUDGET'!I28","v":0},{"$f":"J29*I29*G29","v":0},{"$f":"'GOEDGEKEURD INI BUDGET'!K28","v":0},0,{"$f":"'GOEDGEKEURD INI BUDGET'!M28","v":0},0,0,{"$f":"IF(P29=0,L29,P29+L29)","v":0},{"$f":"K29+P29","v":0},{"$f":"Q29","v":0},{"$f":"R29-Q29","v":0}]
[null,null,"Totaal",null,null,null,null,{"$f":"SUM(H29:H29)","v":0},null,null,{"$f":"SUM(K29:K29)","v":0},{"$f":"SUM(L29:L29)","v":0},{"$f":"IF(K30=0,0,L30/K30)","v":0},{"$f":"SUM(N29:N29)","v":0},{"$f":"IF(K30=0,0,N30/K30)","v":0},{"$f":"SUM(P29)","v":0},{"$f":"SUM(Q29)","v":0},{"$f":"SUM(R29)","v":0},{"$f":"SUM(S29)","v":0},{"$f":"SUM(T29)","v":0}]
[null,null,"Investeringen (vb. hard-en/of software)",null,null,null,null,null,null,null,null,null,null,null,null,null,{"$f":"IF('GOEDGEKEURD INI BUDGET'!K30=L31,\" \",'GOEDGEKEURD INI BUDGET'!K30-L31)","v":" "},{"$f":"IF('GOEDGEKEURD INI BUDGET'!L30=M31,\" \",'GOEDGEKEURD INI BUDGET'!L30-M31)","v":" "},{"$f":"IF('GOEDGEKEURD INI BUDGET'!M30=N31,\" \",'GOEDGEKEURD INI BUDGET'!M30-N31)","v":" "},{"$f":"IF('GOEDGEKEURD INI BUDGET'!N30=O31,\" \",'GOEDGEKEURD INI BUDGET'!N30-O31)","v":" "}]
[null,null,"link naar argumentatie",null,null,null,null,null,null,null,null,null,null,null,null,null,{"$f":"IF('GOEDGEKEURD INI BUDGET'!K31=L32,\" \",'GOEDGEKEURD INI BUDGET'!K31-L32)","v":" "},{"$f":"IF('GOEDGEKEURD INI BUDGET'!L31=M32,\" \",'GOEDGEKEURD INI BUDGET'!L31-M32)","v":" "},{"$f":"IF('GOEDGEKEURD INI BUDGET'!M31=N32,\" \",'GOEDGEKEURD INI BUDGET'!M31-N32)","v":" "},{"$f":"IF('GOEDGEKEURD INI BUDGET'!N31=O32,\" \",'GOEDGEKEURD INI BUDGET'!N31-O32)","v":" "}]
[null,null,{"$f":"'GOEDGEKEURD INI BUDGET'!C31","v":"(Beschrijving in te vullen)"},null,null,null,null,{"$f":"'GOEDGEKEURD INI BUDGET'!G31","v":0},null,{"$f":"'GOEDGEKEURD INI BUDGET'!I31","v":0},{"$f":"H33*J33","v":0},{"$f":"'GOEDGEKEURD INI BUDGET'!K31","v":0},0,{"$f":"'GOEDGEKEURD INI BUDGET'!M31","v":0},0,0,{"$f":"IF(P33=0,L33,P33+L33)","v":0},{"$f":"K33+P33","v":0},{"$f":"Q33","v":0},{"$f":"R33-Q33","v":0}]
[null,null,{"$f":"'GOEDGEKEURD INI BUDGET'!C32","v":"(in te vullen)"},null,null,null,null,{"$f":"'GOEDGEKEURD INI BUDGET'!G32","v":0},null,{"$f":"'GOEDGEKEURD INI BUDGET'!I32","v":0},{"$f":"H34*J34","v":0},{"$f":"'GOEDGEKEURD INI BUDGET'!K32","v":0},0,{"$f":"'GOEDGEKEURD INI BUDGET'!M32","v":0},0,0,0,0,{"$f":"Q34","v":0},0]
[null,null,{"$f":"'GOEDGEKEURD INI BUDGET'!C33","v":"(in te vullen)"},null,null,null,null,{"$f":"'GOEDGEKEURD INI BUDGET'!G33","v":0},null,{"$f":"'GOEDGEKEURD INI BUDGET'!I33","v":0},{"$f":"H35*J35","v":0},{"$f":"'GOEDGEKEURD INI BUDGET'!K33","v":0},0,{"$f":"'GOEDGEKEURD INI BUDGET'!M33","v":0},0,0,0,0,0,0]
[null,null,{"$f":"'GOEDGEKEURD INI BUDGET'!C34","v":"(in te vullen)"},null,null,null,null,{"$f":"'GOEDGEKEURD INI BUDGET'!G34","v":0},null,{"$f":"'GOEDGEKEURD INI BUDGET'!I34","v":0},{"$f":"H36*J36","v":0},{"$f":"'GOEDGEKEURD INI BUDGET'!K34","v":0},0,{"$f":"'GOEDGEKEURD INI BUDGET'!M34","v":0},0,0,0,0,0,0]
[null,null,"Totaal",null,null,null,null,{"$f":"SUM(H33:H36)","v":0},null,null,{"$f":"SUM(K33:K36)","v":0},{"$f":"SUM(L33:L36)","v":0},0,{"$f":"SUM(N33:N36)","v":0},0,{"$f":"SUM(P33:P36)","v":0},{"$f":"SUM(Q33:Q36)","v":0},{"$f":"SUM(R33:R36)","v":0},{"$f":"SUM(S33:S36)","v":0},{"$f":"SUM(T33:T36)","v":0}]
[null,null,"Directe werkingskosten** ",null,null,null,null,null,null,null,null,null,null,null,null,null,{"$f":"IF('GOEDGEKEURD INI BUDGET'!K37=L38,\" \",'GOEDGEKEURD INI BUDGET'!K37-L38)","v":" "},{"$f":"IF('GOEDGEKEURD INI BUDGET'!L37=M38,\" \",'GOEDGEKEURD INI BUDGET'!L37-M38)","v":" "},{"$f":"IF('GOEDGEKEURD INI BUDGET'!M37=N38,\" \",'GOEDGEKEURD INI BUDGET'!M37-N38)","v":" "},{"$f":"IF('GOEDGEKEURD INI BUDGET'!N37=O38,\" \",'GOEDGEKEURD INI BUDGET'!N37-O38)","v":" "}]
[null,null,"link naar argumentatie"]
[null,null,{"$f":"'GOEDGEKEURD INI BUDGET'!C37","v":"Kies uit lijst Directe Werkingskosten"},null,"\u0080",{"$f":"'GOEDGEKEURD INI BUDGET'!E37","v":" "},null,{"$f":"'GOEDGEKEURD INI BUDGET'!G37","v":0},null,null,{"$f":"H40","v":0},{"$f":"'GOEDGEKEURD INI BUDGET'!K37","v":0},0,{"$f":"'GOEDGEKEURD INI BUDGET'!M37","v":0},0,0,{"$f":"IF(P40=0,L40,P40+L40)","v":0},{"$f":"K40+P40","v":0},{"$f":"Q40","v":0},{"$f":"R40-Q40","v":0}]
[null,null,{"$f":"'GOEDGEKEURD INI BUDGET'!C38","v":"Kies uit lijst Directe Werkingskosten"},null,"\u0080",{"$f":"'GOEDGEKEURD INI BUDGET'!E38","v":" "},null,{"$f":"'GOEDGEKEURD INI BUDGET'!G38","v":0},null,null,0,{"$f":"'GOEDGEKEURD INI BUDGET'!K38","v":0},0,{"$f":"'GOEDGEKEURD INI BUDGET'!M38","v":0},0,0,0,0,{"$f":"Q41","v":0},0]
[null,null,{"$f":"'GOEDGEKEURD INI BUDGET'!C39","v":"Kies uit lijst Directe Werkingskosten"},null,"\u0080",{"$f":"'GOEDGEKEURD INI BUDGET'!E39","v":" "},null,{"$f":"'GOEDGEKEURD INI BUDGET'!G39","v":0},null,null,0,{"$f":"'GOEDGEKEURD INI BUDGET'!K39","v":0},0,{"$f":"'GOEDGEKEURD INI BUDGET'!M39","v":0},0,0,0,0,0,0]
[null,null,{"$f":"'GOEDGEKEURD INI BUDGET'!C40","v":"Kies uit lijst Directe Werkingskosten"},null,"\u0080",{"$f":"'GOEDGEKEURD INI BUDGET'!E40","v":" "},null,{"$f":"'GOEDGEKEURD INI BUDGET'!G40","v":0},null,null,0,{"$f":"'GOEDGEKEURD INI BUDGET'!K40","v":0},0,{"$f":"'GOEDGEKEURD INI BUDGET'!M40","v":0},0,0,0,0,0,0]
[null,null,{"$f":"'GOEDGEKEURD INI BUDGET'!C41","v":"Kies uit lijst Directe Werkingskosten"},null,"\u0080",{"$f":"'GOEDGEKEURD INI BUDGET'!E41","v":" "},null,{"$f":"'GOEDGEKEURD INI BUDGET'!G41","v":0},null,null,0,{"$f":"'GOEDGEKEURD INI BUDGET'!K41","v":0},0,{"$f":"'GOEDGEKEURD INI BUDGET'!M41","v":0},0,0,0,0,0,0]
[null,null,{"$f":"'GOEDGEKEURD INI BUDGET'!C42","v":"Kies uit lijst Directe Werkingskosten"},null,"\u0080",{"$f":"'GOEDGEKEURD INI BUDGET'!E42","v":" "},null,{"$f":"'GOEDGEKEURD INI BUDGET'!G42","v":0},null,null,0,{"$f":"'GOEDGEKEURD INI BUDGET'!K42","v":0},0,{"$f":"'GOEDGEKEURD INI BUDGET'!M42","v":0},0,0,0,0,0,0]
[null,null,{"$f":"'GOEDGEKEURD INI BUDGET'!C43","v":"Kies uit lijst Directe Werkingskosten"},null,"\u0080",{"$f":"'GOEDGEKEURD INI BUDGET'!E43","v":" "},null,{"$f":"'GOEDGEKEURD INI BUDGET'!G43","v":0},null,null,0,{"$f":"'GOEDGEKEURD INI BUDGET'!K43","v":0},0,{"$f":"'GOEDGEKEURD INI BUDGET'!M43","v":0},0,0,0,0,0,0]
[null,null,{"$f":"'GOEDGEKEURD INI BUDGET'!C44","v":"Kies uit lijst Directe Werkingskosten"},null,"\u0080",{"$f":"'GOEDGEKEURD INI BUDGET'!E44","v":" "},null,{"$f":"'GOEDGEKEURD INI BUDGET'!G44","v":0},null,null,0,{"$f":"'GOEDGEKEURD INI BUDGET'!K44","v":0},0,{"$f":"'GOEDGEKEURD INI BUDGET'!M44","v":0},0,0,0,0,0,0]
[null,null,{"$f":"'GOEDGEKEURD INI BUDGET'!C45","v":"Kies uit lijst Directe Werkingskosten"},null,"\u0080",{"$f":"'GOEDGEKEURD INI BUDGET'!E45","v":" "},null,{"$f":"'GOEDGEKEURD INI BUDGET'!G45","v":0},null,null,0,{"$f":"'GOEDGEKEURD INI BUDGET'!K45","v":0},0,{"$f":"'GOEDGEKEURD INI BUDGET'!M45","v":0},0,0,0,0,0,0]
[null,null,{"$f":"'GOEDGEKEURD INI BUDGET'!C46","v":"Andere: (zelf in te vullen)"},null,"\u0080",{"$f":"'GOEDGEKEURD INI BUDGET'!E46","v":" "},null,{"$f":"'GOEDGEKEURD INI BUDGET'!G46","v":0},null,null,0,{"$f":"'GOEDGEKEURD INI BUDGET'!K46","v":0},0,{"$f":"'GOEDGEKEURD INI BUDGET'!M46","v":0},0,0,0,0,0,0]
[null,null,{"$f":"'GOEDGEKEURD INI BUDGET'!C47","v":"Andere: (zelf in te vullen)"},null,null,{"$f":"'GOEDGEKEURD INI BUDGET'!E47","v":" "},null,{"$f":"'GOEDGEKEURD INI BUDGET'!G47","v":0},null,null,0,{"$f":"'GOEDGEKEURD INI BUDGET'!K47","v":0},0,{"$f":"'GOEDGEKEURD INI BUDGET'!M47","v":0},0,0,0,0,0,0]
[null,null,"Totaal",null,null,null,null,{"$f":"SUM(H40:H50)","v":0},null,null,{"$f":"SUM(K40:K50)","v":0},{"$f":"SUM(L40:L50)","v":0},{"$f":"IF(K51=0,0,L51/K51)","v":0},{"$f":"SUM(N40:N50)","v":0},0,{"$f":"SUM(P40:P50)","v":0},{"$f":"SUM(Q40:Q50)","v":0},{"$f":"SUM(R40:R50)","v":0},{"$f":"SUM(S40:S50)","v":0},{"$f":"SUM(T40:T50)","v":0}]
[null,null,"Indirecte werkingskosten***",null,null,null,null,null,null,null,null,null,null,null,null,null,{"$f":"IF('GOEDGEKEURD INI BUDGET'!K51=L52,\" \",'GOEDGEKEURD INI BUDGET'!K51-L52)","v":" "},{"$f":"IF('GOEDGEKEURD INI BUDGET'!L51=M52,\" \",'GOEDGEKEURD INI BUDGET'!L51-M52)","v":" "},{"$f":"IF('GOEDGEKEURD INI BUDGET'!M51=N52,\" \",'GOEDGEKEURD INI BUDGET'!M51-N52)","v":" "},{"$f":"IF('GOEDGEKEURD INI BUDGET'!N51=O52,\" \",'GOEDGEKEURD INI BUDGET'!N51-O52)","v":" "}]
[null,null,"link naar argumentatie",null,null,null,null,null,null,null,null,null,null,null,null,null,{"$f":"IF('GOEDGEKEURD INI BUDGET'!K52=L53,\" \",'GOEDGEKEURD INI BUDGET'!K52-L53)","v":" "},{"$f":"IF('GOEDGEKEURD INI BUDGET'!L52=M53,\" \",'GOEDGEKEURD INI BUDGET'!L52-M53)","v":" "},{"$f":"IF('GOEDGEKEURD INI BUDGET'!M52=N53,\" \",'GOEDGEKEURD INI BUDGET'!M52-N53)","v":" "},{"$f":"IF('GOEDGEKEURD INI BUDGET'!N52=O53,\" \",'GOEDGEKEURD INI BUDGET'!N52-O53)","v":" "}]
[null,null,{"$f":"'GOEDGEKEURD INI BUDGET'!C50","v":"Kies uit lijst Indirecte Werkingskosten"},null,"\u0080",{"$f":"'GOEDGEKEURD INI BUDGET'!E50","v":0},null,{"$f":"'GOEDGEKEURD INI BUDGET'!G50","v":0},null,{"$f":"'GOEDGEKEURD INI BUDGET'!I50","v":0},{"$f":"H54*J54","v":0},{"$f":"'GOEDGEKEURD INI BUDGET'!K50","v":0},0,{"$f":"'GOEDGEKEURD INI BUDGET'!M50","v":0},0,0,{"$f":"IF(P54=0,L54,P54+L54)","v":0},{"$f":"K54+P54","v":0},{"$f":"Q54","v":0},{"$f":"R54-Q54","v":0}]
[null,null,{"$f":"'GOEDGEKEURD INI BUDGET'!C51","v":"Kies uit lijst Indirecte Werkingskosten"},null,"\u0080",{"$f":"'GOEDGEKEURD INI BUDGET'!E51","v":0},null,{"$f":"'GOEDGEKEURD INI BUDGET'!G51","v":0},null,{"$f":"'GOEDGEKEURD INI BUDGET'!I51","v":0},0,{"$f":"'GOEDGEKEURD INI BUDGET'!K51","v":0},0,{"$f":"'GOEDGEKEURD INI BUDGET'!M51","v":0},0,0,0,0,{"$f":"Q55","v":0},0]
[null,null,{"$f":"'GOEDGEKEURD INI BUDGET'!C52","v":"Kies uit lijst Indirecte Werkingskosten"},null,"\u0080",{"$f":"'GOEDGEKEURD INI BUDGET'!E52","v":0},null,{"$f":"'GOEDGEKEURD INI BUDGET'!G52","v":0},null,{"$f":"'GOEDGEKEURD INI BUDGET'!I52","v":0},0,{"$f":"'GOEDGEKEURD INI BUDGET'!K52","v":0},0,{"$f":"'GOEDGEKEURD INI BUDGET'!M52","v":0},0,0,0,0,0,0]
[null,null,{"$f":"'GOEDGEKEURD INI BUDGET'!C53","v":"Kies uit lijst Indirecte Werkingskosten"},null,"\u0080",{"$f":"'GOEDGEKEURD INI BUDGET'!E53","v":0},null,{"$f":"'GOEDGEKEURD INI BUDGET'!G53","v":0},null,{"$f":"'GOEDGEKEURD INI BUDGET'!I53","v":0},0,{"$f":"'GOEDGEKEURD INI BUDGET'!K53","v":0},0,{"$f":"'GOEDGEKEURD INI BUDGET'!M53","v":0},0,0,0,0,0,0]
[null,null,{"$f":"'GOEDGEKEURD INI BUDGET'!C54","v":"Kies uit lijst Indirecte Werkingskosten"},null,"\u0080",{"$f":"'GOEDGEKEURD INI BUDGET'!E54","v":0},null,{"$f":"'GOEDGEKEURD INI BUDGET'!G54","v":0},null,{"$f":"'GOEDGEKEURD INI BUDGET'!I54","v":0},0,{"$f":"'GOEDGEKEURD INI BUDGET'!K54","v":0},0,{"$f":"'GOEDGEKEURD INI BUDGET'!M54","v":0},0,0,0,0,0,0]
[null,null,{"$f":"'GOEDGEKEURD INI BUDGET'!C55","v":"Kies uit lijst Indirecte Werkingskosten"},null,"\u0080",{"$f":"'GOEDGEKEURD INI BUDGET'!E55","v":0},null,{"$f":"'GOEDGEKEURD INI BUDGET'!G55","v":0},null,{"$f":"'GOEDGEKEURD INI BUDGET'!I55","v":0},0,{"$f":"'GOEDGEKEURD INI BUDGET'!K55","v":0},0,{"$f":"'GOEDGEKEURD INI BUDGET'!M55","v":0},0,0,0,0,0,0]
[null,null,{"$f":"'GOEDGEKEURD INI BUDGET'!C56","v":"Kies uit lijst Indirecte Werkingskosten"},null,"\u0080",{"$f":"'GOEDGEKEURD INI BUDGET'!E56","v":0},null,{"$f":"'GOEDGEKEURD INI BUDGET'!G56","v":0},null,{"$f":"'GOEDGEKEURD INI BUDGET'!I56","v":0},0,{"$f":"'GOEDGEKEURD INI BUDGET'!K56","v":0},0,{"$f":"'GOEDGEKEURD INI BUDGET'!M56","v":0},0,0,0,0,0,0]
[null,null,{"$f":"'GOEDGEKEURD INI BUDGET'!C57","v":"Kies uit lijst Indirecte Werkingskosten"},null,"\u0080",{"$f":"'GOEDGEKEURD INI BUDGET'!E57","v":0},null,{"$f":"'GOEDGEKEURD INI BUDGET'!G57","v":0},null,{"$f":"'GOEDGEKEURD INI BUDGET'!I57","v":0},0,{"$f":"'GOEDGEKEURD INI BUDGET'!K57","v":0},0,{"$f":"'GOEDGEKEURD INI BUDGET'!M57","v":0},0,0,0,0,0,0]
[null,null,{"$f":"'GOEDGEKEURD INI BUDGET'!C58","v":"Kies uit lijst Indirecte Werkingskosten"},null,"\u0080",{"$f":"'GOEDGEKEURD INI BUDGET'!E58","v":0},null,{"$f":"'GOEDGEKEURD INI BUDGET'!G58","v":0},null,{"$f":"'GOEDGEKEURD INI BUDGET'!I58","v":0},0,{"$f":"'GOEDGEKEURD INI BUDGET'!K58","v":0},0,{"$f":"'GOEDGEKEURD INI BUDGET'!M58","v":0},0,0,0,0,0,0]
[null,null,{"$f":"'GOEDGEKEURD INI BUDGET'!C59","v":"Kies uit lijst Indirecte Werkingskosten"},null,"\u0080",{"$f":"'GOEDGEKEURD INI BUDGET'!E59","v":0},null,{"$f":"'GOEDGEKEURD INI BUDGET'!G59","v":0},null,{"$f":"'GOEDGEKEURD INI BUDGET'!I59","v":0},{"$f":"H63*J63","v":0},{"$f":"'GOEDGEKEURD INI BUDGET'!K59","v":0},{"$f":"IF(K63=0,0,L63/K63)","v":0},{"$f":"'GOEDGEKEURD INI BUDGET'!M59","v":0},{"$f":"IF(K63=0,0,N63/K63)","v":0},0,{"$f":"IF(P63=0,L63,P63+L63)","v":0},0,0,0]
[null,null,{"$f":"'GOEDGEKEURD INI BUDGET'!C60","v":"Andere: (zelf in te vullen)"},null,"\u0080",{"$f":"'GOEDGEKEURD INI BUDGET'!E60","v":0},null,{"$f":"'GOEDGEKEURD INI BUDGET'!G60","v":0},null,{"$f":"'GOEDGEKEURD INI BUDGET'!I60","v":0},0,{"$f":"'GOEDGEKEURD INI BUDGET'!K60","v":0},0,{"$f":"'GOEDGEKEURD INI BUDGET'!M60","v":0},0,0,0,0,0,0]
[null,null,{"$f":"'GOEDGEKEURD INI BUDGET'!C61","v":"Andere: (zelf in te vullen)"},null,null,{"$f":"'GOEDGEKEURD INI BUDGET'!E61","v":0},null,{"$f":"'GOEDGEKEURD INI BUDGET'!G61","v":0},null,{"$f":"'GOEDGEKEURD INI BUDGET'!I61","v":0},0,{"$f":"'GOEDGEKEURD INI BUDGET'!K61","v":0},0,{"$f":"'GOEDGEKEURD INI BUDGET'!M61","v":0},0,0,0,0,0,0]
[null,null,"Totaal",null,null,null,null,{"$f":"SUM(H54:H65)","v":0},null,null,{"$f":"SUM(K54:K65)","v":0},{"$f":"SUM(L54:L65)","v":0},{"$f":"IF(K66=0,0,L66/K66)","v":0},{"$f":"SUM(N54:N65)","v":0},{"$f":"IF(K66=0,0,N66/K66)","v":0},{"$f":"SUM(P54:P65)","v":0},{"$f":"SUM(Q54:Q65)","v":0},{"$f":"SUM(R54:R65)","v":0},{"$f":"SUM(S54:S65)","v":0},{"$f":"SUM(T54:T65)","v":0}]
[null,null,null,null,null,null,"MAX TOEGELATEN INDIRECTE KOSTEN ****:",null,null,null,null,{"$f":"(L27+L30+L37+L51)/100*7","v":0}]
[null,null,"TOTAAL",null,null,null,null,null,null,null,{"$f":"K66+K51+K37+K30+K27","v":0},{"$f":"L66+L51+L37+L30+L27","v":0},0,{"$f":"N66+N51+N37+N30+N27","v":0},0,{"$f":"P66+P51+P37+P30+P27","v":0},{"$f":"Q66+Q51+Q37+Q30+Q27","v":0},{"$f":"R66+R51+R37+R30+R27","v":0},{"$f":"S66+S51+S37+S30+S27","v":0},{"$f":"T66+T51+T37+T30+T27","v":0}]
[null,null,"* Indien een gedeelte of het geheel van de subsidie als co-financiering wordt aangewend, moet de verdeling hier worden aangeduid. Gelieve, per project, een kolom toe te voegen."]
[null,null,"** Directe werkingskosten: Het gaat om kosten die boekhoudkundig aan het project of activiteit worden toegewezen. Indien niet mogelijk kunnen deze kosten worden gecategoriseerd als 'indirecte werkingskosten'. "]
[null,null,"*** Indirecte werkingskosten:'Het gaat om kosten die boekhoudkundig niet volledig aan het project of activiteit kunnen worden toegewezen. Deze kost wordt via een verdeelsleutel toegewezen. "]
[null,null,"     De gehanteerde verdeelsleutel moet verklaard worden in het inhoudelijk verslag. "]
[null,null,"**** max toegelaten indirecte kosten met Fedasil subsidies: 7% van de som van personeel, huur, investeringen en directe werkingskosten"]
[]
[null,null,"Financiering",null,null,null,"Detail Financieringsbron","Zekerheid",null,null,"Totaal bedrag project","Subsidievraag Fedasil (project of activiteit)","% Fedasil","Andere financierings-bronnen","% andere bronnen"]
[null,null,{"$f":"'GOEDGEKEURD INI BUDGET'!C72","v":"Fedasil"},null,null,null,null,{"$f":"'GOEDGEKEURD INI BUDGET'!G72","v":"Aangevraagd"},null,null,{"$f":"L76","v":0},{"$f":"L68","v":0},{"$f":"IF($K$68=0,0,L76/$K$68)","v":0}]
[null,null,"Kies uit lijst Financiering",null,"\u0080",null,null,{"$f":"'GOEDGEKEURD INI BUDGET'!G73","v":"(in te vullen)"},null,null,{"$f":"N77","v":0},null,null,{"$f":"'GOEDGEKEURD INI BUDGET'!M73","v":0},{"$f":"IF($K$68=0,0,N77/$K$68)","v":0}]
[null,null,"Kies uit lijst Financiering",null,"\u0080",null,null,{"$f":"'GOEDGEKEURD INI BUDGET'!G74","v":"(in te vullen)"},null,null,0,null,null,{"$f":"'GOEDGEKEURD INI BUDGET'!M74","v":0},0]
[null,null,"Kies uit lijst Financiering",null,"\u0080",null,null,{"$f":"'GOEDGEKEURD INI BUDGET'!G75","v":"(in te vullen)"},null,null,0,null,null,{"$f":"'GOEDGEKEURD INI BUDGET'!M75","v":0},0]
[null,null,"Kies uit lijst Financiering",null,"\u0080",null,null,{"$f":"'GOEDGEKEURD INI BUDGET'!G76","v":"(in te vullen)"},null,null,{"$f":"N80","v":0},null,null,{"$f":"'GOEDGEKEURD INI BUDGET'!M76","v":0},0]
[null,null,"Andere: (zelf in te vullen)",null,null,null,null,{"$f":"'GOEDGEKEURD INI BUDGET'!G77","v":"(in te vullen)"},null,null,0,null,null,{"$f":"'GOEDGEKEURD INI BUDGET'!M77","v":0},0]
[null,null,"TOTAAL",null,null,null,null,null,null,null,{"$f":"SUM(K76:K81)","v":0},{"$f":"SUM(L76:L81)","v":0},{"$f":"IF($K$68=0,0,L82/$K$68)","v":0},{"$f":"SUM(N77:N81)","v":0},{"$f":"IF($K$68=0,0,N82/$K$68)","v":0}]
[]
[null,null,null,null,null,null,"VERSCHIL TUSSEN BUDGET EN FINANCIERING",null,null,null,{"$f":"K68-K82","v":0},null,null,{"$f":"N68-N82","v":0}]
[]
[]
[]
[]
[]
[]
[]
[]
[]
[]
[]
[]
[]
[]
[]
[null,null,"ARGUMENTATIE BUDGETWIJZIGING",null,null,null,null,null,null,null,null,"BEOORDELING BUDGETWIJZIGING FEDASIL",null,null,null,null,null,null,"OK?"]
[]
[null,null,"PERSONEELSKOSTEN",null,null,"TERUG NAAR BOVEN"]
[]
[]
[]
[]
[]
[]
[]
[]
[]
[]
[null,null,"HUUR",null,null,"TERUG NAAR BOVEN"]
[]
[]
[]
[]
[]
[]
[]
[]
[]
[]
[null,null,"INVESTERINGEN",null,null,"TERUG NAAR BOVEN"]
[]
[]
[]
[]
[]
[]
[]
[]
[]
[]
[null,null,"DIRECTE WERKINGSKOSTEN",null,null,"TERUG NAAR BOVEN"]
[]
[]
[]
[]
[]
[]
[]
[]
[]
[]
[null,null,"INDIRECTE WERKINGSKOSTEN",null,null,"TERUG NAAR BOVEN"]

{"sheet":"GOEDGEKEURD BUDGET AJU","index":6,"n_rows":77,"n_cols":14,"rows_kept":77,"cut":false,"hidden":true,"merged":[[2,8,3,9],[40,4,40,5],[41,4,41,5],[42,4,42,5],[43,4,43,5],[53,2,53,3],[48,2,48,3],[49,2,49,3],[50,2,50,3],[51,2,51,3],[52,2,52,3],[43,2,43,3],[45,2,45,3],[46,2,46,3],[47,2,47,3],[44,2,44,3],[54,2,54,3],[56,2,56,3],[57,2,57,3],[60,2,60,8],[58,2,58,3],[55,2,55,3],[38,2,38,3],[39,2,39,3],[40,2,40,3],[41,2,41,3],[42,2,42,3],[37,2,37,3],[28,2,28,3],[29,2,29,3],[30,2,30,3],[32,2,32,3],[33,2,33,3],[34,2,34,3],[35,2,35,3],[36,2,36,3],[7,2,7,3],[12,2,12,3],[8,2,8,3],[9,2,9,3],[10,2,10,3],[11,2,11,3],[13,2,13,3],[23,2,23,3],[22,2,22,3],[25,2,25,3],[31,2,31,3],[27,2,27,3],[24,2,24,3],[26,2,26,3],[3,11,3,13],[59,5,59,9],[76,5,76,8],[8,4,8,13],[9,4,9,13],[11,4,11,13],[10,4,10,13],[7,4,7,13],[2,4,3,7],[33,4,33,5],[34,4,34,5],[35,4,35,5],[36,4,36,5],[37,4,37,5],[38,4,38,5],[39,4,39,5]]}
[]
[]
[null,null,null,null,"GOEDGEKEURD AJU BUDGET",null,null,null,{"$f":"'GOEDGEKEURD INI BUDGET'!J3","v":"2021/XX"}]
[null,null,null,null,null,null,null,null,null,null,null,"GOEDGEKEURD BUDGET AJU"]
[]
[]
[]
[null,null,{"$f":"'AANVRAAG BUDGET AJU'!C8","v":"Datum aanvraag:"},null,{"$f":"'AANVRAAG BUDGET AJU'!F8","v":"2020-09-11"}]
[null,null,"Begunstigde:",null,{"$f":"'AANVRAAG BUDGET AJU'!F9","v":0}]
[null,null,"Project:",null,{"$f":"'AANVRAAG BUDGET AJU'!F10","v":0}]
[null,null,"Contactpersoon",null,{"$f":"'AANVRAAG BUDGET AJU'!F11","v":0}]
[null,null,"Looptijd project (aantal maanden):",null,{"$f":"'AANVRAAG BUDGET AJU'!F12","v":0}]
[null,null,{"$f":"'AANVRAAG BUDGET AJU'!C17","v":"Budget 2021"},null,"VTE","Eenheidskost (per maand)","Eenheidskost (per jaar)","Aantal maanden project","% van de tijd aan het project","Totaal bedrag project","Akkoord Fedasil AJU BUDGET (project of activiteit)","% Fedasil","Andere financierings-bronnen","% andere bronnen"]
[null,null,"Personeel",null,"(stap1)","(stap2)",null,"(stap3)","(stap4)",null,"(stap5)"]
[null,null,{"$f":"'AANVRAAG BUDGET AJU'!C19","v":"(naam in te vullen)"},{"$f":"'AANVRAAG BUDGET AJU'!D19","v":"(functie in te vullen)"},{"$f":"'AANVRAAG BUDGET AJU'!F19","v":0},{"$f":"'AANVRAAG BUDGET AJU'!G19","v":0},{"$f":"F15*12","v":0},{"$f":"'AANVRAAG BUDGET AJU'!I19","v":0},{"$f":"'AANVRAAG BUDGET AJU'!J19","v":0},{"$f":"'AANVRAAG BUDGET AJU'!R19","v":0},{"$f":"'AANVRAAG BUDGET AJU'!Q19","v":0},{"$f":"IF('AANVRAAG BUDGET AJU'!P19=0,'AANVRAAG BUDGET AJU'!M19,'GOEDGEKEURD BUDGET AJU'!K15/'GOEDGEKEURD BUDGET AJU'!J15)","v":0},{"$f":"J15-K15","v":0},{"$f":"IF(J15=0,0,M15/J15)","v":0}]
[null,null,{"$f":"'AANVRAAG BUDGET AJU'!C20","v":"(naam in te vullen)"},{"$f":"'AANVRAAG BUDGET AJU'!D20","v":"(functie in te vullen)"},{"$f":"'AANVRAAG BUDGET AJU'!F20","v":0},{"$f":"'AANVRAAG BUDGET AJU'!G20","v":0},{"$f":"F16*12","v":0},{"$f":"'AANVRAAG BUDGET AJU'!I20","v":0},{"$f":"'AANVRAAG BUDGET AJU'!J20","v":0},{"$f":"'AANVRAAG BUDGET AJU'!R20","v":0},{"$f":"'AANVRAAG BUDGET AJU'!Q20","v":0},{"$f":"IF('AANVRAAG BUDGET AJU'!P20=0,'AANVRAAG BUDGET AJU'!M20,'GOEDGEKEURD BUDGET AJU'!K16/'GOEDGEKEURD BUDGET AJU'!J16)","v":0},{"$f":"J16-K16","v":0},{"$f":"IF(J16=0,0,M16/J16)","v":0}]
[null,null,{"$f":"'AANVRAAG BUDGET AJU'!C21","v":"(naam in te vullen)"},{"$f":"'AANVRAAG BUDGET AJU'!D21","v":"(functie in te vullen)"},{"$f":"'AANVRAAG BUDGET AJU'!F21","v":0},{"$f":"'AANVRAAG BUDGET AJU'!G21","v":0},0,{"$f":"'AANVRAAG BUDGET AJU'!I21","v":0},{"$f":"'AANVRAAG BUDGET AJU'!J21","v":0},{"$f":"'AANVRAAG BUDGET AJU'!R21","v":0},{"$f":"'AANVRAAG BUDGET AJU'!Q21","v":0},{"$f":"IF('AANVRAAG BUDGET AJU'!P21=0,'AANVRAAG BUDGET AJU'!M21,'GOEDGEKEURD BUDGET AJU'!K17/'GOEDGEKEURD BUDGET AJU'!J17)","v":0},0,{"$f":"IF(J17=0,0,M17/J17)","v":0}]
[null,null,{"$f":"'AANVRAAG BUDGET AJU'!C22","v":"(naam in te vullen)"},{"$f":"'AANVRAAG BUDGET AJU'!D22","v":"(functie in te vullen)"},{"$f":"'AANVRAAG BUDGET AJU'!F22","v":0},{"$f":"'AANVRAAG BUDGET AJU'!G22","v":0},0,{"$f":"'AANVRAAG BUDGET AJU'!I22","v":0},{"$f":"'AANVRAAG BUDGET AJU'!J22","v":0},{"$f":"'AANVRAAG BUDGET AJU'!R22","v":0},{"$f":"'AANVRAAG BUDGET AJU'!Q22","v":0},{"$f":"IF('AANVRAAG BUDGET AJU'!P22=0,'AANVRAAG BUDGET AJU'!M22,'GOEDGEKEURD BUDGET AJU'!K18/'GOEDGEKEURD BUDGET AJU'!J18)","v":0},0,0]
[null,null,{"$f":"'AANVRAAG BUDGET AJU'!C23","v":"(naam in te vullen)"},{"$f":"'AANVRAAG BUDGET AJU'!D23","v":"(functie in te vullen)"},{"$f":"'AANVRAAG BUDGET AJU'!F23","v":0},{"$f":"'AANVRAAG BUDGET AJU'!G23","v":0},0,{"$f":"'AANVRAAG BUDGET AJU'!I23","v":0},{"$f":"'AANVRAAG BUDGET AJU'!J23","v":0},{"$f":"'AANVRAAG BUDGET AJU'!R23","v":0},{"$f":"'AANVRAAG BUDGET AJU'!Q23","v":0},{"$f":"IF('AANVRAAG BUDGET AJU'!P23=0,'AANVRAAG BUDGET AJU'!M23,'GOEDGEKEURD BUDGET AJU'!K19/'GOEDGEKEURD BUDGET AJU'!J19)","v":0},0,0]
[null,null,{"$f":"'AANVRAAG BUDGET AJU'!C24","v":"(naam in te vullen)"},{"$f":"'AANVRAAG BUDGET AJU'!D24","v":"(functie in te vullen)"},{"$f":"'AANVRAAG BUDGET AJU'!F24","v":0},{"$f":"'AANVRAAG BUDGET AJU'!G24","v":0},0,{"$f":"'AANVRAAG BUDGET AJU'!I24","v":0},{"$f":"'AANVRAAG BUDGET AJU'!J24","v":0},{"$f":"'AANVRAAG BUDGET AJU'!R24","v":0},{"$f":"'AANVRAAG BUDGET AJU'!Q24","v":0},{"$f":"IF('AANVRAAG BUDGET AJU'!P24=0,'AANVRAAG BUDGET AJU'!M24,'GOEDGEKEURD BUDGET AJU'!K20/'GOEDGEKEURD BUDGET AJU'!J20)","v":0},0,0]
[null,null,{"$f":"'AANVRAAG BUDGET AJU'!C25","v":"(naam in te vullen)"},{"$f":"'AANVRAAG BUDGET AJU'!D25","v":"(functie in te vullen)"},{"$f":"'AANVRAAG BUDGET AJU'!F25","v":0},{"$f":"'AANVRAAG BUDGET AJU'!G25","v":0},0,{"$f":"'AANVRAAG BUDGET AJU'!I25","v":0},{"$f":"'AANVRAAG BUDGET AJU'!J25","v":0},{"$f":"'AANVRAAG BUDGET AJU'!R25","v":0},{"$f":"'AANVRAAG BUDGET AJU'!Q25","v":0},{"$f":"IF('AANVRAAG BUDGET AJU'!P25=0,'AANVRAAG BUDGET AJU'!M25,'GOEDGEKEURD BUDGET AJU'!K21/'GOEDGEKEURD BUDGET AJU'!J21)","v":0},0,0]
[null,null,{"$f":"'AANVRAAG BUDGET AJU'!C26","v":"(naam in te vullen)"},{"$f":"'AANVRAAG BUDGET AJU'!D26","v":"(functie in te vullen)"},{"$f":"'AANVRAAG BUDGET AJU'!F26","v":0},{"$f":"'AANVRAAG BUDGET AJU'!G26","v":0},{"$f":"F22*12","v":0},{"$f":"'AANVRAAG BUDGET AJU'!I26","v":0},{"$f":"'AANVRAAG BUDGET AJU'!J26","v":0},{"$f":"'AANVRAAG BUDGET AJU'!R26","v":0},{"$f":"'AANVRAAG BUDGET AJU'!Q26","v":0},{"$f":"IF('AANVRAAG BUDGET AJU'!P26=0,'AANVRAAG BUDGET AJU'!M26,'GOEDGEKEURD BUDGET AJU'!K22/'GOEDGEKEURD BUDGET AJU'!J22)","v":0},0,0]
[null,null,"Totaal",null,{"$f":"SUM(E15:E22)","v":0},null,{"$f":"SUM(G15:G22)","v":0},null,null,{"$f":"SUM(J15:J22)","v":0},{"$f":"SUM(K15:K22)","v":0},{"$f":"IF(J23=0,0,K23/J23)","v":0},{"$f":"SUM(M15:M22)","v":0},{"$f":"IF(J23=0,0,M23/J23)","v":0}]
[null,null,"Huur"]
[null,null,{"$f":"'AANVRAAG BUDGET AJU'!C29","v":"(Voorwerp/Gebouw & Adres in te vullen)"},null,null,{"$f":"'AANVRAAG BUDGET AJU'!G29","v":0},{"$f":"+F25*12","v":0},{"$f":"'AANVRAAG BUDGET AJU'!I29","v":0},{"$f":"'AANVRAAG BUDGET AJU'!J29","v":0},{"$f":"'AANVRAAG BUDGET AJU'!R29","v":0},{"$f":"'AANVRAAG BUDGET AJU'!Q29","v":0},{"$f":"IF('AANVRAAG BUDGET AJU'!P29=0,'AANVRAAG BUDGET AJU'!M29,'GOEDGEKEURD BUDGET AJU'!K25/'GOEDGEKEURD BUDGET AJU'!J25)","v":0},{"$f":"J25-K25","v":0},0]
[null,null,"Totaal",null,null,null,{"$f":"SUM(G25:G25)","v":0},null,null,{"$f":"SUM(J25:J25)","v":0},{"$f":"SUM(K25)","v":0},{"$f":"IF(J26=0,0,K26/J26)","v":0},{"$f":"SUM(M25:M25)","v":0},{"$f":"IF(J26=0,0,M26/J26)","v":0}]
[null,null,"Investeringen (vb. hard-en/of software) "]
[null,null,{"$f":"'AANVRAAG BUDGET AJU'!C33","v":"(Beschrijving in te vullen)"},null,null,null,{"$f":"'AANVRAAG BUDGET AJU'!H33","v":0},null,{"$f":"'AANVRAAG BUDGET AJU'!J33","v":0},{"$f":"'AANVRAAG BUDGET AJU'!R33","v":0},{"$f":"'AANVRAAG BUDGET AJU'!Q33","v":0},{"$f":"IF('AANVRAAG BUDGET AJU'!P33=0,'AANVRAAG BUDGET AJU'!M33,'GOEDGEKEURD BUDGET AJU'!K28/'GOEDGEKEURD BUDGET AJU'!J28)","v":0},{"$f":"J28-K28","v":0},0]
[null,null,{"$f":"'AANVRAAG BUDGET AJU'!C34","v":"(in te vullen)"},null,null,null,{"$f":"'AANVRAAG BUDGET AJU'!H34","v":0},null,{"$f":"'AANVRAAG BUDGET AJU'!J34","v":0},{"$f":"'AANVRAAG BUDGET AJU'!R34","v":0},{"$f":"'AANVRAAG BUDGET AJU'!Q34","v":0},{"$f":"IF('AANVRAAG BUDGET AJU'!P34=0,'AANVRAAG BUDGET AJU'!M34,'GOEDGEKEURD BUDGET AJU'!K29/'GOEDGEKEURD BUDGET AJU'!J29)","v":0},{"$f":"J29-K29","v":0},0]
[null,null,{"$f":"'AANVRAAG BUDGET AJU'!C35","v":"(in te vullen)"},null,null,null,{"$f":"'AANVRAAG BUDGET AJU'!H35","v":0},null,{"$f":"'AANVRAAG BUDGET AJU'!J35","v":0},{"$f":"'AANVRAAG BUDGET AJU'!R35","v":0},{"$f":"'AANVRAAG BUDGET AJU'!Q35","v":0},{"$f":"IF('AANVRAAG BUDGET AJU'!P35=0,'AANVRAAG BUDGET AJU'!M35,'GOEDGEKEURD BUDGET AJU'!K30/'GOEDGEKEURD BUDGET AJU'!J30)","v":0},{"$f":"J30-K30","v":0},0]
[null,null,{"$f":"'AANVRAAG BUDGET AJU'!C36","v":"(in te vullen)"},null,null,null,{"$f":"'AANVRAAG BUDGET AJU'!H36","v":0},null,{"$f":"'AANVRAAG BUDGET AJU'!J36","v":0},{"$f":"'AANVRAAG BUDGET AJU'!R36","v":0},{"$f":"'AANVRAAG BUDGET AJU'!Q36","v":0},{"$f":"IF('AANVRAAG BUDGET AJU'!P36=0,'AANVRAAG BUDGET AJU'!M36,'GOEDGEKEURD BUDGET AJU'!K31/'GOEDGEKEURD BUDGET AJU'!J31)","v":0},{"$f":"J31-K31","v":0},0]
[null,null,"Totaal",null,null,null,{"$f":"SUM(G28:G31)","v":0},null,null,{"$f":"SUM(J28:J31)","v":0},{"$f":"SUM(K28:K31)","v":0},{"$f":"IF(J32=0,0,K32/J32)","v":0},{"$f":"SUM(M28:M31)","v":0},0]
[null,null,"Directe werkingskosten**"]
[null,null,{"$f":"'AANVRAAG BUDGET AJU'!C40","v":"Kies uit lijst Directe Werkingskosten"},null,{"$f":"'AANVRAAG BUDGET AJU'!F40","v":" "},null,{"$f":"'AANVRAAG BUDGET AJU'!H40","v":0},null,null,{"$f":"'AANVRAAG BUDGET AJU'!R40","v":0},{"$f":"'AANVRAAG BUDGET AJU'!Q40","v":0},0,{"$f":"J34-K34","v":0},0]
[null,null,{"$f":"'AANVRAAG BUDGET AJU'!C41","v":"Kies uit lijst Directe Werkingskosten"},null,{"$f":"'AANVRAAG BUDGET AJU'!F41","v":" "},null,{"$f":"'AANVRAAG BUDGET AJU'!H41","v":0},null,null,{"$f":"'AANVRAAG BUDGET AJU'!R41","v":0},{"$f":"'AANVRAAG BUDGET AJU'!Q41","v":0},0,{"$f":"J35-K35","v":0},0]
[null,null,{"$f":"'AANVRAAG BUDGET AJU'!C42","v":"Kies uit lijst Directe Werkingskosten"},null,{"$f":"'AANVRAAG BUDGET AJU'!F42","v":" "},null,{"$f":"'AANVRAAG BUDGET AJU'!H42","v":0},null,null,{"$f":"'AANVRAAG BUDGET AJU'!R42","v":0},{"$f":"'AANVRAAG BUDGET AJU'!Q42","v":0},0,0,0]
[null,null,{"$f":"'AANVRAAG BUDGET AJU'!C43","v":"Kies uit lijst Directe Werkingskosten"},null,{"$f":"'AANVRAAG BUDGET AJU'!F43","v":" "},null,{"$f":"'AANVRAAG BUDGET AJU'!H43","v":0},null,null,{"$f":"'AANVRAAG BUDGET AJU'!R43","v":0},{"$f":"'AANVRAAG BUDGET AJU'!Q43","v":0},0,0,0]
[null,null,{"$f":"'AANVRAAG BUDGET AJU'!C44","v":"Kies uit lijst Directe Werkingskosten"},null,{"$f":"'AANVRAAG BUDGET AJU'!F44","v":" "},null,{"$f":"'AANVRAAG BUDGET AJU'!H44","v":0},null,null,{"$f":"'AANVRAAG BUDGET AJU'!R44","v":0},{"$f":"'AANVRAAG BUDGET AJU'!Q44","v":0},0,0,0]
[null,null,{"$f":"'AANVRAAG BUDGET AJU'!C45","v":"Kies uit lijst Directe Werkingskosten"},null,{"$f":"'AANVRAAG BUDGET AJU'!F45","v":" "},null,{"$f":"'AANVRAAG BUDGET AJU'!H45","v":0},null,null,{"$f":"'AANVRAAG BUDGET AJU'!R45","v":0},{"$f":"'AANVRAAG BUDGET AJU'!Q45","v":0},0,{"$f":"J39-K39","v":0},0]
[null,null,{"$f":"'AANVRAAG BUDGET AJU'!C46","v":"Kies uit lijst Directe Werkingskosten"},null,{"$f":"'AANVRAAG BUDGET AJU'!F46","v":" "},null,{"$f":"'AANVRAAG BUDGET AJU'!H46","v":0},null,null,{"$f":"'AANVRAAG BUDGET AJU'!R46","v":0},{"$f":"'AANVRAAG BUDGET AJU'!Q46","v":0},0,{"$f":"J40-K40","v":0},0]
[null,null,{"$f":"'AANVRAAG BUDGET AJU'!C47","v":"Kies uit lijst Directe Werkingskosten"},null,{"$f":"'AANVRAAG BUDGET AJU'!F47","v":" "},null,{"$f":"'AANVRAAG BUDGET AJU'!H47","v":0},null,null,{"$f":"'AANVRAAG BUDGET AJU'!R47","v":0},{"$f":"'AANVRAAG BUDGET AJU'!Q47","v":0},0,{"$f":"J41-K41","v":0},0]
[null,null,{"$f":"'AANVRAAG BUDGET AJU'!C48","v":"Kies uit lijst Directe Werkingskosten"},null,{"$f":"'AANVRAAG BUDGET AJU'!F48","v":" "},null,{"$f":"'AANVRAAG BUDGET AJU'!H48","v":0},null,null,{"$f":"'AANVRAAG BUDGET AJU'!R48","v":0},{"$f":"'AANVRAAG BUDGET AJU'!Q48","v":0},0,{"$f":"J42-K42","v":0},0]
[null,null,{"$f":"'AANVRAAG BUDGET AJU'!C49","v":"Andere: (zelf in te vullen)"},null,{"$f":"'AANVRAAG BUDGET AJU'!F49","v":" "},null,{"$f":"'AANVRAAG BUDGET AJU'!H49","v":0},null,null,{"$f":"'AANVRAAG BUDGET AJU'!R49","v":0},{"$f":"'AANVRAAG BUDGET AJU'!Q49","v":0},0,{"$f":"J43-K43","v":0},0]
[null,null,{"$f":"'AANVRAAG BUDGET AJU'!C50","v":"Andere: (zelf in te vullen)"},null,{"$f":"'AANVRAAG BUDGET AJU'!F50","v":" "},null,{"$f":"'AANVRAAG BUDGET AJU'!H50","v":0},null,null,{"$f":"'AANVRAAG BUDGET AJU'!R50","v":0},{"$f":"'AANVRAAG BUDGET AJU'!Q50","v":0},0,0,0]
[null,null,"Totaal",null,null,null,{"$f":"SUM(G34:G44)","v":0},null,null,{"$f":"SUM(J34:J44)","v":0},{"$f":"SUM(K34:K44)","v":0},{"$f":"IF(J45=0,0,K45/J45)","v":0},{"$f":"SUM(M34:M44)","v":0},0]
[null,null,"Indirecte werkingskosten***"]
[null,null,{"$f":"'AANVRAAG BUDGET AJU'!C54","v":"Kies uit lijst Indirecte Werkingskosten"},null,null,null,{"$f":"'AANVRAAG BUDGET AJU'!H54","v":0},null,{"$f":"'AANVRAAG BUDGET AJU'!J54","v":0},{"$f":"'AANVRAAG BUDGET AJU'!R54","v":0},{"$f":"'AANVRAAG BUDGET AJU'!Q54","v":0},{"$f":"IF('AANVRAAG BUDGET AJU'!P54=0,'AANVRAAG BUDGET AJU'!M54,'GOEDGEKEURD BUDGET AJU'!K47/'GOEDGEKEURD BUDGET AJU'!J47)","v":0},{"$f":"J47-K47","v":0},0]
[null,null,{"$f":"'AANVRAAG BUDGET AJU'!C55","v":"Kies uit lijst Indirecte Werkingskosten"},null,null,null,{"$f":"'AANVRAAG BUDGET AJU'!H55","v":0},null,{"$f":"'AANVRAAG BUDGET AJU'!J55","v":0},{"$f":"'AANVRAAG BUDGET AJU'!R55","v":0},{"$f":"'AANVRAAG BUDGET AJU'!Q55","v":0},{"$f":"IF('AANVRAAG BUDGET AJU'!P55=0,'AANVRAAG BUDGET AJU'!M55,'GOEDGEKEURD BUDGET AJU'!K48/'GOEDGEKEURD BUDGET AJU'!J48)","v":0},{"$f":"J48-K48","v":0},0]
[null,null,{"$f":"'AANVRAAG BUDGET AJU'!C56","v":"Kies uit lijst Indirecte Werkingskosten"},null,null,null,{"$f":"'AANVRAAG BUDGET AJU'!H56","v":0},null,{"$f":"'AANVRAAG BUDGET AJU'!J56","v":0},{"$f":"'AANVRAAG BUDGET AJU'!R56","v":0},{"$f":"'AANVRAAG BUDGET AJU'!Q56","v":0},{"$f":"IF('AANVRAAG BUDGET AJU'!P56=0,'AANVRAAG BUDGET AJU'!M56,'GOEDGEKEURD BUDGET AJU'!K49/'GOEDGEKEURD BUDGET AJU'!J49)","v":0},0,0]
[null,null,{"$f":"'AANVRAAG BUDGET AJU'!C57","v":"Kies uit lijst Indirecte Werkingskosten"},null,null,null,{"$f":"'AANVRAAG BUDGET AJU'!H57","v":0},null,{"$f":"'AANVRAAG BUDGET AJU'!J57","v":0},{"$f":"'AANVRAAG BUDGET AJU'!R57","v":0},{"$f":"'AANVRAAG BUDGET AJU'!Q57","v":0},{"$f":"IF('AANVRAAG BUDGET AJU'!P57=0,'AANVRAAG BUDGET AJU'!M57,'GOEDGEKEURD BUDGET AJU'!K50/'GOEDGEKEURD BUDGET AJU'!J50)","v":0},0,0]
[null,null,{"$f":"'AANVRAAG BUDGET AJU'!C58","v":"Kies uit lijst Indirecte Werkingskosten"},null,null,null,{"$f":"'AANVRAAG BUDGET AJU'!H58","v":0},null,{"$f":"'AANVRAAG BUDGET AJU'!J58","v":0},{"$f":"'AANVRAAG BUDGET AJU'!R58","v":0},{"$f":"'AANVRAAG BUDGET AJU'!Q58","v":0},{"$f":"IF('AANVRAAG BUDGET AJU'!P58=0,'AANVRAAG BUDGET AJU'!M58,'GOEDGEKEURD BUDGET AJU'!K51/'GOEDGEKEURD BUDGET AJU'!J51)","v":0},{"$f":"J51-K51","v":0},0]
[null,null,{"$f":"'AANVRAAG BUDGET AJU'!C59","v":"Kies uit lijst Indirecte Werkingskosten"},null,null,null,{"$f":"'AANVRAAG BUDGET AJU'!H59","v":0},null,{"$f":"'AANVRAAG BUDGET AJU'!J59","v":0},{"$f":"'AANVRAAG BUDGET AJU'!R59","v":0},{"$f":"'AANVRAAG BUDGET AJU'!Q59","v":0},{"$f":"IF('AANVRAAG BUDGET AJU'!P59=0,'AANVRAAG BUDGET AJU'!M59,'GOEDGEKEURD BUDGET AJU'!K52/'GOEDGEKEURD BUDGET AJU'!J52)","v":0},{"$f":"J52-K52","v":0},0]
[null,null,{"$f":"'AANVRAAG BUDGET AJU'!C60","v":"Kies uit lijst Indirecte Werkingskosten"},null,null,null,{"$f":"'AANVRAAG BUDGET AJU'!H60","v":0},null,{"$f":"'AANVRAAG BUDGET AJU'!J60","v":0},{"$f":"'AANVRAAG BUDGET AJU'!R60","v":0},{"$f":"'AANVRAAG BUDGET AJU'!Q60","v":0},{"$f":"IF('AANVRAAG BUDGET AJU'!P60=0,'AANVRAAG BUDGET AJU'!M60,'GOEDGEKEURD BUDGET AJU'!K53/'GOEDGEKEURD BUDGET AJU'!J53)","v":0},0,0]
[null,null,{"$f":"'AANVRAAG BUDGET AJU'!C61","v":"Kies uit lijst Indirecte Werkingskosten"},null,null,null,{"$f":"'AANVRAAG BUDGET AJU'!H61","v":0},null,{"$f":"'AANVRAAG BUDGET AJU'!J61","v":0},{"$f":"'AANVRAAG BUDGET AJU'!R61","v":0},{"$f":"'AANVRAAG BUDGET AJU'!Q61","v":0},{"$f":"IF('AANVRAAG BUDGET AJU'!P61=0,'AANVRAAG BUDGET AJU'!M61,'GOEDGEKEURD BUDGET AJU'!K54/'GOEDGEKEURD BUDGET AJU'!J54)","v":0},0,0]
[null,null,{"$f":"'AANVRAAG BUDGET AJU'!C62","v":"Kies uit lijst Indirecte Werkingskosten"},null,null,null,{"$f":"'AANVRAAG BUDGET AJU'!H62","v":0},null,{"$f":"'AANVRAAG BUDGET AJU'!J62","v":0},{"$f":"'AANVRAAG BUDGET AJU'!R62","v":0},{"$f":"'AANVRAAG BUDGET AJU'!Q62","v":0},{"$f":"IF('AANVRAAG BUDGET AJU'!P62=0,'AANVRAAG BUDGET AJU'!M62,'GOEDGEKEURD BUDGET AJU'!K55/'GOEDGEKEURD BUDGET AJU'!J55)","v":0},0,0]
[null,null,{"$f":"'AANVRAAG BUDGET AJU'!C63","v":"Kies uit lijst Indirecte Werkingskosten"},null,null,null,{"$f":"'AANVRAAG BUDGET AJU'!H63","v":0},null,{"$f":"'AANVRAAG BUDGET AJU'!J63","v":0},{"$f":"'AANVRAAG BUDGET AJU'!R63","v":0},{"$f":"'AANVRAAG BUDGET AJU'!Q63","v":0},{"$f":"IF('AANVRAAG BUDGET AJU'!P63=0,'AANVRAAG BUDGET AJU'!M63,'GOEDGEKEURD BUDGET AJU'!K56/'GOEDGEKEURD BUDGET AJU'!J56)","v":0},{"$f":"J56-K56","v":0},{"$f":"IF(J56=0,0,M56/J56)","v":0}]
[null,null,{"$f":"'AANVRAAG BUDGET AJU'!C64","v":"Andere: (zelf in te vullen)"},null,null,null,{"$f":"'AANVRAAG BUDGET AJU'!H64","v":0},null,{"$f":"'AANVRAAG BUDGET AJU'!J64","v":0},{"$f":"'AANVRAAG BUDGET AJU'!R64","v":0},{"$f":"'AANVRAAG BUDGET AJU'!Q64","v":0},{"$f":"IF('AANVRAAG BUDGET AJU'!P64=0,'AANVRAAG BUDGET AJU'!M64,'GOEDGEKEURD BUDGET AJU'!K57/'GOEDGEKEURD BUDGET AJU'!J57)","v":0},0,0]
[null,null,{"$f":"'AANVRAAG BUDGET AJU'!C65","v":"Andere: (zelf in te vullen)"},null,null,null,{"$f":"'AANVRAAG BUDGET AJU'!H65","v":0},null,{"$f":"'AANVRAAG BUDGET AJU'!J65","v":0},{"$f":"'AANVRAAG BUDGET AJU'!R65","v":0},{"$f":"'AANVRAAG BUDGET AJU'!Q65","v":0},{"$f":"IF('AANVRAAG BUDGET AJU'!P65=0,'AANVRAAG BUDGET AJU'!M65,'GOEDGEKEURD BUDGET AJU'!K58/'GOEDGEKEURD BUDGET AJU'!J58)","v":0},0,0]
[null,null,"Totaal",null,null,null,{"$f":"SUM(G47:G58)","v":0},null,null,{"$f":"SUM(J47:J58)","v":0},{"$f":"SUM(K47:K58)","v":0},{"$f":"IF(J59=0,0,K59/J59)","v":0},{"$f":"SUM(M47:M58)","v":0},{"$f":"IF(J59=0,0,M59/J59)","v":0}]
[null,null,null,null,null,"MAX TOEGELATEN INDIRECTE KOSTEN ****:",null,null,null,null,{"$f":"(K23+K26+K32+K45)/100*7","v":0}]
[null,null,"TOTAAL",null,null,null,null,null,null,{"$f":"J59+J45+J32+J26+J23","v":0},{"$f":"K59+K45+K32+K26+K23","v":0},0,{"$f":"M59+M45+M32+M26+M23","v":0},0]
[null,null,"* Indien een gedeelte of het geheel van de subsidie als co-financiering wordt aangewend, moet de verdeling hier worden aangeduid. Gelieve, per project, een kolom toe te voegen."]
[null,null,"** Directe werkingskosten: Het gaat om kosten die boekhoudkundig aan het project of activiteit worden toegewezen. Indien niet mogelijk kunnen deze kosten worden gecategoriseerd als 'andere werkingskosten'. "]
[null,null,"*** Indirecte werkingskosten:'Het gaat om kosten die boekhoudkundig niet volledig aan het project of activiteit kunnen worden toegewezen. Deze kost wordt via een verdeelsleutel toegewezen. "]
[null,null,"     De gehanteerde verdeelsleutel moet verklaard worden in het inhoudelijk verslag. "]
[null,null,"**** max toegelaten indirecte kosten: 7% van de som van personeel, huur, investeringen en directe werkingskosten"]
[]
[null,null,"Financiering",null,null,null,"Zekerheid",null,null,"Totaal bedrag project","Akkoord Fedasil AJU BUDGET (project of activiteit)","% Fedasil","Andere financierings-bronnen","% andere bronnen"]
[null,null,{"$f":"'AANVRAAG BUDGET AJU'!C76","v":"Fedasil"},null,null,null,{"$f":"'AANVRAAG BUDGET AJU'!H76","v":"Aangevraagd"},null,null,{"$f":"K69","v":0},{"$f":"K61","v":0},{"$f":"IF('AANVRAAG BUDGET AJU'!P76=0,'AANVRAAG BUDGET AJU'!M76,'GOEDGEKEURD BUDGET AJU'!K69/'GOEDGEKEURD BUDGET AJU'!J69)","v":0}]
[null,null,{"$f":"'AANVRAAG BUDGET AJU'!C77","v":"Kies uit lijst Financiering"},null,null,null,{"$f":"'AANVRAAG BUDGET AJU'!H77","v":"(in te vullen)"},null,null,{"$f":"M70","v":0},null,null,{"$f":"'AANVRAAG BUDGET AJU'!N77","v":0},{"$f":"IF($J$61=0,0,M70/$J$61)","v":0}]
[null,null,{"$f":"'AANVRAAG BUDGET AJU'!C78","v":"Kies uit lijst Financiering"},null,null,null,{"$f":"'AANVRAAG BUDGET AJU'!H78","v":"(in te vullen)"},null,null,0,null,null,{"$f":"'AANVRAAG BUDGET AJU'!N78","v":0},0]
[null,null,{"$f":"'AANVRAAG BUDGET AJU'!C79","v":"Kies uit lijst Financiering"},null,null,null,{"$f":"'AANVRAAG BUDGET AJU'!H79","v":"(in te vullen)"},null,null,0,null,null,{"$f":"'AANVRAAG BUDGET AJU'!N79","v":0},0]
[null,null,{"$f":"'AANVRAAG BUDGET AJU'!C80","v":"Kies uit lijst Financiering"},null,null,null,{"$f":"'AANVRAAG BUDGET AJU'!H80","v":"(in te vullen)"},null,null,{"$f":"M73","v":0},null,null,{"$f":"'AANVRAAG BUDGET AJU'!N80","v":0},0]
[null,null,{"$f":"'AANVRAAG BUDGET AJU'!C81","v":"Andere: (zelf in te vullen)"},null,null,null,{"$f":"'AANVRAAG BUDGET AJU'!H81","v":"(in te vullen)"},null,null,0,null,null,{"$f":"'AANVRAAG BUDGET AJU'!N81","v":0},0]
[null,null,"TOTAAL",null,null,null,null,null,null,{"$f":"SUM(J69:J74)","v":0},{"$f":"SUM(K69:K74)","v":0},{"$f":"IF($J$61=0,0,K75/$J$61)","v":0},{"$f":"SUM(M70:M74)","v":0},{"$f":"IF($J$61=0,0,M75/$J$61)","v":0}]
[]
[null,null,null,null,null,"VERSCHIL TUSSEN BUDGET EN FINANCIERING",null,null,null,{"$f":"J61-J75","v":0},null,null,{"$f":"M61-M75","v":0}]

{"sheet":"INSTRUCTIE WERKELIJKE UITGAVEN","index":7,"n_rows":48,"n_cols":1,"rows_kept":48,"cut":false,"hidden":true,"merged":[]}
["INSTRUCTIE WERKELIJKE UITGAVEN"]
[]
["TUSSENTIJDS FINANCIEEL VERSLAG"]
["TIMING INDIENING"]
["Zie overeenkomst"]
[]
["FORMAT DOCUMENTEN"]
["elektronische versie + gedrukte versie in één exemplaar"]
[]
["WELKE DOCUMENTEN"]
[" 1)  een gedetailleerde overzichtslijst in Excel formaat van alle uitgaven van de tussentijdse uitgaven, die de volgende informatie moet bevatten: "]
["* Een gedetailleerde lijst van elke individuele uitgave, met vermelding van het bedrag, de datum, het documentnummer, de projectcode, "]
["  de naam van de leverancier en een korte omschrijving van de gemaakte kost;"]
["* Voor uitgaven boven €500: een meer gedetailleerde omschrijving en motivatie van de gemaakte kost in het kader van de doelstellingen van het project;"]
["* Voor wat betreft de personeelskosten: een motivatie en/of bewijs dat de personen voor dewelke personeelskosten zijn ingediend "]
["   voor de aangeduide tijd voor het project hebben gewerkt;"]
["* Een lijst van de onderaannemers en indien nodig de offerte aanvraag;"]
[" 2) schuldvordering met betrekking tot het tweede voorschot (30%) indien de tussentijdse uitgaven meer is dan de helft van het initiële voorschot, "]
["     getekend door rechtspersonen. (mag per mail)"]
[]
["FINANCIEEL EINDVERSLAG"]
["TIMING INDIENING"]
["Ten laatste tegen 31 januari, 1 maand na einde van het projectjaar"]
[]
["FORMAT DOCUMENTEN"]
["elektronische versie + gedrukte versie in één exemplaar"]
[]
["WELKE DOCUMENTEN"]
[" 1)  een gedetailleerde overzichtslijst in Excel formaat van alle uitgaven (“listing”), die de volgende informatie moet bevatten: "]
["* Een financiële eindafrekening van de daadwerkelijk gemaakte subsidiabele kosten, opgesteld volgens de structuur van de geraamde begroting, "]
["   vergezeld van een kopie van de bewijsstukken."]
["   Vooraleer een kopie wordt genomen duidt de begunstigde op de originele verantwoordingsstukken de eventuele verdeling "]
["   over verschillende financieringsbronnen aan. Deze vermeldingen dienen duidelijk aan te tonen of de terugbetaling volledig of gedeeltelijk van het Agentschap"]
["   wordt teruggevorderd."]
["* Een gedetailleerde overzichtslijst van alle uitgaven in Excel formaat met een korte omschrijving voor uitgaven onder €500 euro "]
["  en een meer gedetailleerde omschrijving en motivatie voor uitgaven boven € 500 euro."]
["* Antwoorden op een aantal specifieke vragen rond de procedures, zoals deze beschreven zijn in de standaard listing template."]
[" 2) schuldvordering met betrekking tot het laatste voorschot ( max 20%). Indien men geen 80% van het projectbudget heeft uitgegeven, gelieve een credit nota op te stellen."]
[" 3) Uiterlijk 6 maanden na het einde van het jaar waarop de overeenkomst betrekking heeft dient de begunstigde een kopie van de goedgekeurde jaarrekening in."]
[]
[]
["WAT WENST U NU TE DOEN?"]
[]
["← klik op button"]
["← klik op button"]
["← klik op button"]
["← klik op button"]
["← klik op button"]

{"sheet":"VRAGEN EINDRAPPORT","index":8,"n_rows":51,"n_cols":1,"rows_kept":51,"cut":false,"hidden":true,"merged":[[4,0,4,3],[36,0,36,3],[40,0,40,3],[44,0,44,3],[48,0,48,3],[8,0,8,3],[18,0,18,3],[24,0,24,3]]}
[]
[]
[]
[]
["FINANCIËLE VRAGEN BIJ EINDRAPPORT"]
[]
["Nota: Indien het antwoord reeds is vermeld of toegelicht in het financieel verslag, gelieve er naar te verwijzen."]
[]
["1. ORGANISATIE"]
[]
["- Werkt de organisatie met een boekhoudkantoor? "]
[]
["- Werkt de organisatie samen met een revisor? "]
[]
["- Gelieve ons de analytische boekhouding voor het Fedasilproject te bezorgen."]
[]
["- Gelieve ons de laatst goedgekeurde resultatenrekening, gedetailleerd per rubriek te bezorgen. "]
[]
["2. BUDGET"]
[]
["- Zijn er overschotten in de aangevraagde kredieten? Zoja, gelieve ons de reden voor de onderbenutting van de subsidie te bezorgen."]
[]
["- Gelieve uw eventuele opmerkingen met betrekking tot de gerealiseerde uitgaven vs budget te vermelden."]
[]
["3. PERSONEELSKOSTEN"]
[]
["- Hebben er wijzigingen plaatsgevonden in de personeelskosten of hun toewijzing ervan versus het budget? Indien ja, welke?"]
[]
["- Gelieve ons de recente functiebeschrijvingen te bezorgen, voor de personen tewerkgesteld in het kader van het project. "]
[]
["- Gelieve de gehanteerde verdeelsleutels te motiveren en te staven. "]
[]
["- Gelieve ons een kopie van de timesheets te bezorgen voor de personen die niet voor 100% toegewezen worden aan het project. "]
[]
["- Gelieve ons de berekening van het vakantiegeld en de eindejaarspremie te verschaffen? "]
[]
["4. HUUR"]
[]
["- Gelieve de gehanteerde verdeelsleutels te motiveren en te staven. "]
[]
["5. INVESTERINGEN"]
[]
["- Gelieve ons de toegepaste algemene waarderingsregels en afschrijvingsregels toe te lichten. "]
[]
["6. DIRECTE WERKINGSKOSTEN"]
[]
["- Gelieve ons voor iedere onderaanneming de 3 offertes bij de 3 verschillende leveranciers te bezorgen. "]
[]
["7. INDIRECTE WERKINGSKOSTEN"]
[]
["- Gelieve de gehanteerde verdeelsleutels te motiveren en te staven. "]

{"sheet":"ARGUMENTATIE","index":9,"n_rows":60,"n_cols":1,"rows_kept":60,"cut":false,"hidden":true,"merged":[[28,0,38,0],[16,0,26,0],[4,0,14,0],[40,0,50,0]]}
["ARGUMENTATIE VERSCHIL BUDGET vs ACTUAL"]
[]
["FINANCIEEL EINDVERSLAG"]
["PERSONEELSKOSTEN"]
[]
[]
[]
[]
[]
[]
[]
[]
[]
[]
[]
["HUUR"]
[]
[]
[]
[]
[]
[]
[]
[]
[]
[]
[]
["DIRECTE WERKINGSKOSTEN "]
[]
[]
[]
[]
[]
[]
[]
[]
[]
[]
[]
["INDIRECTE WERKINGSKOSTEN "]
[]
[]
[]
[]
[]
[]
[]
[]
[]
[]
[]
[]
[]
["WAT WENST U NU TE DOEN?"]
[]
["← klik op button"]
["← klik op button"]
["← klik op button"]
["← klik op button"]
["← klik op button"]

{"sheet":"Samenvatting Budget-Uitgaven","index":10,"n_rows":9,"n_cols":5,"rows_kept":9,"cut":false,"hidden":true,"merged":[[0,0,1,4]]}
["SAMENVATTING INGEDIENDE UITGAVEN"]
[]
["Kostensoort","Budget","Werkelijke uitgaven","Variantie (€)","Variantie (%)"]
["Personeel",{"$f":"'GOEDGEKEURD BUDGET AJU'!K23","v":0},{"$f":"Personeelskosten!N133","v":0},{"$f":"C4-B4","v":0},{"$f":"IFERROR(C4/B4,\"0%\")","v":"0%"}]
["Huur",{"$f":"'GOEDGEKEURD BUDGET AJU'!K26","v":0},{"$f":"Huur!H19","v":0},0,{"$f":"IFERROR(C5/B5,\"0%\")","v":"0%"}]
["Investeringen",{"$f":"'GOEDGEKEURD BUDGET AJU'!K32","v":0},{"$f":"Investeringen!K10","v":0},0,"0%"]
["Directe werkingskosten",{"$f":"'GOEDGEKEURD BUDGET AJU'!K45","v":0},{"$f":"'Directe werkingskosten'!I149","v":0},0,"0%"]
["Andere werkingskosten",{"$f":"'GOEDGEKEURD BUDGET AJU'!K59","v":0},{"$f":"'Indirecte werkingskosten'!I162","v":0},0,"0%"]
["Totaal",{"$f":"SUM(B4:B8)","v":0},{"$f":"SUM(C4:C8)","v":0},0,{"$f":"IFERROR(C9/B9,\"0%\")","v":"0%"}]

{"sheet":"Personeelskosten","index":11,"n_rows":142,"n_cols":23,"rows_kept":142,"cut":false,"hidden":true,"merged":[[0,19,2,22],[132,22,133,22],[4,18,19,18],[143,1,143,17],[144,1,144,17],[138,1,138,17],[139,1,139,17],[140,1,140,17],[141,1,141,17],[142,1,142,17],[132,0,133,1],[132,2,133,2],[132,19,133,19],[132,20,133,20],[132,21,133,21],[132,16,133,16],[132,13,133,13],[132,10,133,12]]}
["Personeelskosten",null,"Alle cijfers moeten gemakkelijk terug te vinden zijn in de geleverde bewijsstukken. Indien niet, gelieve meer uitleg te verschaffen bij de opmerkingen",null,null,null,null,null,null,null,null,null,null,null,null,null,null,null,null,"INPUT FEDASIL"]
[]
["1. Detail kosten"]
[]
["Doc. Nr.","Naam (of 'aan te werven')","Periode\nvan       tot","Voltijds-equivalenten","Bruto salaris\n(A)\n","Patronale bijdragen\n(B)","Verplaatsings-kosten Woon-werk verkeer\n(C)","Andere lasten: te preciseren\n(D)","Andere lasten: te preciseren\n(E)","Total cost\n(A+B+C+D+E)=F","% van de op het project geaffecteerde werktijd  (G)\n","Totaal Bedrag financiering project (F*G)=H","% aandeel fedasil financiering","Bedrag aandeel fedasil","% aandeel andere financiersingsbronnen","Opmerkingen","Andere financierings-bronnen reële uitgaven","% andere bronnen",null,"Subsidiabel Fedasil","Niet subsidiabel","Opmerkingen FEDASIL na controle","Extra input OPE FEDASIL na controle"]
[null,{"$f":"'GOEDGEKEURD BUDGET AJU'!C15","v":"(naam in te vullen)"},"januari",null,null,null,null,null,null,{"$f":"+E6+F6+G6+H6+I6","v":0},{"$f":"'GOEDGEKEURD BUDGET AJU'!$I$15","v":0},{"$f":"+J6*K6","v":0},{"$f":"'GOEDGEKEURD BUDGET AJU'!$L$15","v":0},{"$f":"L6*M6","v":0},{"$f":"1-M6","v":1},null,{"$f":"L6-N6","v":0},{"$f":"IFERROR(Q6/J6,0)","v":0},null,{"$f":"N6-U6","v":0}]
[null,null,"februari",null,null,null,null,null,null,{"$f":"+E7+F7+G7+H7+I7","v":0},{"$f":"'GOEDGEKEURD BUDGET AJU'!$I$15","v":0},{"$f":"+J7*K7","v":0},{"$f":"'GOEDGEKEURD BUDGET AJU'!$L$15","v":0},{"$f":"L7*M7","v":0},{"$f":"1-M7","v":1},null,{"$f":"L7-N7","v":0},0,null,{"$f":"N7-U7","v":0}]
[null,null,"maart",null,null,null,null,null,null,{"$f":"+E8+F8+G8+H8+I8","v":0},{"$f":"'GOEDGEKEURD BUDGET AJU'!$I$15","v":0},0,{"$f":"'GOEDGEKEURD BUDGET AJU'!$L$15","v":0},0,1,null,0,0,null,0]
[null,null,"april",null,null,null,null,null,null,0,{"$f":"'GOEDGEKEURD BUDGET AJU'!$I$15","v":0},0,{"$f":"'GOEDGEKEURD BUDGET AJU'!$L$15","v":0},0,1,null,0,0,null,{"$f":"N9-U9","v":0}]
[null,null,"mei",null,null,null,null,null,null,0,{"$f":"'GOEDGEKEURD BUDGET AJU'!$I$15","v":0},0,{"$f":"'GOEDGEKEURD BUDGET AJU'!$L$15","v":0},0,1,null,0,0,null,0]
[null,null,"juni",null,null,null,null,null,null,0,{"$f":"'GOEDGEKEURD BUDGET AJU'!$I$15","v":0},0,{"$f":"'GOEDGEKEURD BUDGET AJU'!$L$15","v":0},0,1,null,0,0,null,0]
[null,null,"Vakantiegeld",null,null,null,null,null,null,0,{"$f":"'GOEDGEKEURD BUDGET AJU'!$I$15","v":0},0,{"$f":"'GOEDGEKEURD BUDGET AJU'!$L$15","v":0},0,1,null,0,0,null,0]
[null,null,"juli",null,null,null,null,null,null,0,{"$f":"'GOEDGEKEURD BUDGET AJU'!$I$15","v":0},0,{"$f":"'GOEDGEKEURD BUDGET AJU'!$L$15","v":0},0,1,null,0,0,null,0]
[null,null,"augustus",null,null,null,null,null,null,0,{"$f":"'GOEDGEKEURD BUDGET AJU'!$I$15","v":0},0,{"$f":"'GOEDGEKEURD BUDGET AJU'!$L$15","v":0},0,1,null,0,0,null,0]
[null,null,"september",null,null,null,null,null,null,0,{"$f":"'GOEDGEKEURD BUDGET AJU'!$I$15","v":0},0,{"$f":"'GOEDGEKEURD BUDGET AJU'!$L$15","v":0},0,1,null,0,0,null,0]
[null,null,"oktober",null,null,null,null,null,null,0,{"$f":"'GOEDGEKEURD BUDGET AJU'!$I$15","v":0},0,{"$f":"'GOEDGEKEURD BUDGET AJU'!$L$15","v":0},0,1,null,0,0,null,0]
[null,null,"november",null,null,null,null,null,null,0,{"$f":"'GOEDGEKEURD BUDGET AJU'!$I$15","v":0},0,{"$f":"'GOEDGEKEURD BUDGET AJU'!$L$15","v":0},0,1,null,0,0,null,0]
[null,null,"december",null,null,null,null,null,null,0,{"$f":"'GOEDGEKEURD BUDGET AJU'!$I$15","v":0},0,{"$f":"'GOEDGEKEURD BUDGET AJU'!$L$15","v":0},0,1,null,0,0,null,0]
[null,null,"Eindejaarspremie",null,null,null,null,null,null,0,{"$f":"'GOEDGEKEURD BUDGET AJU'!$I$15","v":0},0,{"$f":"'GOEDGEKEURD BUDGET AJU'!$L$15","v":0},0,1,null,0,0,null,0]
[null,null,"TOTAAL",null,{"$f":"SUM(E6:E19)","v":0},0,0,0,0,{"$f":"SUM(J6:J19)","v":0},null,{"$f":"SUM(L6:L19)","v":0},null,{"$f":"SUM(N6:N19)","v":0},{"$f":"AVERAGE(O6:O19)","v":1},null,{"$f":"SUM(Q6:Q19)","v":0},null,null,{"$f":"SUM(T6:T19)","v":0},{"$f":"SUM(U6:U19)","v":0}]
[null,null,null,null,null,null,null,null,null,null,null,null,null,null,null,null,null,{"$f":"IFERROR(Q21/J21,0)","v":0}]
[null,{"$f":"'GOEDGEKEURD BUDGET AJU'!C16","v":"(naam in te vullen)"},"januari",null,null,null,null,null,null,0,{"$f":"'GOEDGEKEURD BUDGET AJU'!$I$16","v":0},{"$f":"+J22*K22","v":0},{"$f":"'GOEDGEKEURD BUDGET AJU'!$L$16","v":0},{"$f":"L22*M22","v":0},{"$f":"1-M22","v":1},null,{"$f":"L22-N22","v":0},0,null,{"$f":"N22-U22","v":0}]
[null,null,"februari",null,null,null,null,null,null,0,{"$f":"'GOEDGEKEURD BUDGET AJU'!$I$16","v":0},{"$f":"+J23*K23","v":0},{"$f":"'GOEDGEKEURD BUDGET AJU'!$L$16","v":0},{"$f":"L23*M23","v":0},{"$f":"1-M23","v":1},null,0,0,null,0]
[null,null,"maart",null,null,null,null,null,null,0,{"$f":"'GOEDGEKEURD BUDGET AJU'!$I$16","v":0},0,{"$f":"'GOEDGEKEURD BUDGET AJU'!$L$16","v":0},0,1,null,0,0,null,0]
[null,null,"april",null,null,null,null,null,null,0,{"$f":"'GOEDGEKEURD BUDGET AJU'!$I$16","v":0},0,{"$f":"'GOEDGEKEURD BUDGET AJU'!$L$16","v":0},0,1,null,0,0,null,0]
[null,null,"mei",null,null,null,null,null,null,0,{"$f":"'GOEDGEKEURD BUDGET AJU'!$I$16","v":0},0,{"$f":"'GOEDGEKEURD BUDGET AJU'!$L$16","v":0},0,1,null,0,0,null,0]
[null,null,"juni",null,null,null,null,null,null,0,{"$f":"'GOEDGEKEURD BUDGET AJU'!$I$16","v":0},0,{"$f":"'GOEDGEKEURD BUDGET AJU'!$L$16","v":0},0,1,null,0,0,null,0]
[null,null,"Vakantiegeld",null,null,null,null,null,null,0,{"$f":"'GOEDGEKEURD BUDGET AJU'!$I$16","v":0},0,{"$f":"'GOEDGEKEURD BUDGET AJU'!$L$16","v":0},0,1,null,0,0,null,0]
[null,null,"juli",null,null,null,null,null,null,0,{"$f":"'GOEDGEKEURD BUDGET AJU'!$I$16","v":0},0,{"$f":"'GOEDGEKEURD BUDGET AJU'!$L$16","v":0},0,1,null,0,0,null,0]
[null,null,"augustus",null,null,null,null,null,null,0,{"$f":"'GOEDGEKEURD BUDGET AJU'!$I$16","v":0},0,{"$f":"'GOEDGEKEURD BUDGET AJU'!$L$16","v":0},0,1,null,0,0,null,0]
[null,null,"september",null,null,null,null,null,null,0,{"$f":"'GOEDGEKEURD BUDGET AJU'!$I$16","v":0},0,{"$f":"'GOEDGEKEURD BUDGET AJU'!$L$16","v":0},0,1,null,0,0,null,0]
[null,null,"oktober",null,null,null,null,null,null,0,{"$f":"'GOEDGEKEURD BUDGET AJU'!$I$16","v":0},0,{"$f":"'GOEDGEKEURD BUDGET AJU'!$L$16","v":0},0,1,null,0,0,null,0]
[null,null,"november",null,null,null,null,null,null,0,{"$f":"'GOEDGEKEURD BUDGET AJU'!$I$16","v":0},0,{"$f":"'GOEDGEKEURD BUDGET AJU'!$L$16","v":0},0,1,null,0,0,null,0]
[null,null,"december",null,null,null,null,null,null,0,{"$f":"'GOEDGEKEURD BUDGET AJU'!$I$16","v":0},0,{"$f":"'GOEDGEKEURD BUDGET AJU'!$L$16","v":0},0,1,null,0,0,null,0]
[null,null,"Eindejaarspremie",null,null,null,null,null,null,0,{"$f":"'GOEDGEKEURD BUDGET AJU'!$I$16","v":0},0,{"$f":"'GOEDGEKEURD BUDGET AJU'!$L$16","v":0},0,1,null,0,0,null,0]
[null,null,"TOTAAL",null,{"$f":"SUM(E22:E35)","v":0},{"$f":"SUM(F22:F35)","v":0},0,0,0,{"$f":"SUM(J22:J35)","v":0},null,{"$f":"SUM(L22:L35)","v":0},null,{"$f":"SUM(N22:N35)","v":0},{"$f":"AVERAGE(O22:O35)","v":1},null,{"$f":"SUM(Q22:Q35)","v":0},null,null,{"$f":"SUM(T22:T35)","v":0},{"$f":"SUM(U23:U35)","v":0}]
[null,null,null,null,null,null,null,null,null,null,null,null,null,null,null,null,null,{"$f":"IFERROR(Q37/J37,0)","v":0}]
[null,{"$f":"'GOEDGEKEURD BUDGET AJU'!C17","v":"(naam in te vullen)"},"januari",null,null,null,null,null,null,0,{"$f":"'GOEDGEKEURD BUDGET AJU'!$I$17","v":0},{"$f":"+J38*K38","v":0},{"$f":"'GOEDGEKEURD BUDGET AJU'!$L$17","v":0},{"$f":"L38*M38","v":0},{"$f":"1-M38","v":1},null,{"$f":"L38-N38","v":0},0,null,{"$f":"N38-U38","v":0}]
[null,null,"februari",null,null,null,null,null,null,0,{"$f":"'GOEDGEKEURD BUDGET AJU'!$I$17","v":0},{"$f":"+J39*K39","v":0},{"$f":"'GOEDGEKEURD BUDGET AJU'!$L$17","v":0},{"$f":"L39*0.89","v":0},{"$f":"1-M39","v":1},null,0,0,null,0]
[null,null,"maart",null,null,null,null,null,null,0,{"$f":"'GOEDGEKEURD BUDGET AJU'!$I$17","v":0},0,{"$f":"'GOEDGEKEURD BUDGET AJU'!$L$17","v":0},0,1,null,0,0,null,0]
[null,null,"april",null,null,null,null,null,null,0,{"$f":"'GOEDGEKEURD BUDGET AJU'!$I$17","v":0},0,{"$f":"'GOEDGEKEURD BUDGET AJU'!$L$17","v":0},0,1,null,0,0,null,0]
[null,null,"mei",null,null,null,null,null,null,0,{"$f":"'GOEDGEKEURD BUDGET AJU'!$I$17","v":0},0,{"$f":"'GOEDGEKEURD BUDGET AJU'!$L$17","v":0},0,1,null,0,0,null,0]
[null,null,"juni",null,null,null,null,null,null,0,{"$f":"'GOEDGEKEURD BUDGET AJU'!$I$17","v":0},0,{"$f":"'GOEDGEKEURD BUDGET AJU'!$L$17","v":0},0,1,null,0,0,null,0]
[null,null,"Vakantiegeld",null,null,null,null,null,null,0,{"$f":"'GOEDGEKEURD BUDGET AJU'!$I$17","v":0},0,{"$f":"'GOEDGEKEURD BUDGET AJU'!$L$17","v":0},0,1,null,0,0,null,0]
[null,null,"juli",null,null,null,null,null,null,0,{"$f":"'GOEDGEKEURD BUDGET AJU'!$I$17","v":0},0,{"$f":"'GOEDGEKEURD BUDGET AJU'!$L$17","v":0},0,1,null,0,0,null,0]
[null,null,"augustus",null,null,null,null,null,null,0,{"$f":"'GOEDGEKEURD BUDGET AJU'!$I$17","v":0},0,{"$f":"'GOEDGEKEURD BUDGET AJU'!$L$17","v":0},0,1,null,0,0,null,0]
[null,null,"september",null,null,null,null,null,null,0,{"$f":"'GOEDGEKEURD BUDGET AJU'!$I$17","v":0},0,{"$f":"'GOEDGEKEURD BUDGET AJU'!$L$17","v":0},0,1,null,0,0,null,0]
[null,null,"oktober",null,null,null,null,null,null,0,{"$f":"'GOEDGEKEURD BUDGET AJU'!$I$17","v":0},0,{"$f":"'GOEDGEKEURD BUDGET AJU'!$L$17","v":0},0,1,null,0,0,null,0]
[null,null,"november",null,null,null,null,null,null,0,{"$f":"'GOEDGEKEURD BUDGET AJU'!$I$17","v":0},0,{"$f":"'GOEDGEKEURD BUDGET AJU'!$L$17","v":0},0,1,null,0,0,null,0]
[null,null,"december",null,null,null,null,null,null,0,{"$f":"'GOEDGEKEURD BUDGET AJU'!$I$17","v":0},0,{"$f":"'GOEDGEKEURD BUDGET AJU'!$L$17","v":0},0,1,null,0,0,null,0]
[null,null,"Eindejaarspremie",null,null,null,null,null,null,0,{"$f":"'GOEDGEKEURD BUDGET AJU'!$I$17","v":0},0,{"$f":"'GOEDGEKEURD BUDGET AJU'!$L$17","v":0},0,1,null,0,0,null,0]
[null,null,"TOTAAL",null,{"$f":"SUM(E38:E51)","v":0},{"$f":"SUM(F38:F51)","v":0},0,0,0,0,null,{"$f":"SUM(L38:L51)","v":0},null,{"$f":"SUM(N38:N51)","v":0},{"$f":"AVERAGE(O38:O51)","v":1},null,{"$f":"SUM(Q38:Q51)","v":0},null,null,{"$f":"SUM(T38:T51)","v":0},{"$f":"SUM(U39:U51)","v":0}]
[null,null,null,null,null,null,null,null,null,null,null,null,null,null,null,null,null,{"$f":"IFERROR(Q53/J53,0)","v":0}]
[null,{"$f":"'GOEDGEKEURD BUDGET AJU'!C18","v":"(naam in te vullen)"},"januari",null,null,null,null,null,null,{"$f":"+E54+F54+G54+H54+I54","v":0},{"$f":"'GOEDGEKEURD BUDGET AJU'!$I$18","v":0},{"$f":"+J54*K54","v":0},{"$f":"'GOEDGEKEURD BUDGET AJU'!$L$18","v":0},{"$f":"L54*M54","v":0},{"$f":"1-M54","v":1},null,{"$f":"L54-N54","v":0},0,null,{"$f":"N54-U54","v":0}]
[null,null,"februari",null,null,null,null,null,null,0,{"$f":"'GOEDGEKEURD BUDGET AJU'!$I$18","v":0},{"$f":"+J55*K55","v":0},{"$f":"'GOEDGEKEURD BUDGET AJU'!$L$18","v":0},{"$f":"L55*0.89","v":0},{"$f":"1-M55","v":1},null,0,0,null,0]
[null,null,"maart",null,null,null,null,null,null,0,{"$f":"'GOEDGEKEURD BUDGET AJU'!$I$18","v":0},0,{"$f":"'GOEDGEKEURD BUDGET AJU'!$L$18","v":0},0,1,null,0,0,null,0]
[null,null,"april",null,null,null,null,null,null,0,{"$f":"'GOEDGEKEURD BUDGET AJU'!$I$18","v":0},0,{"$f":"'GOEDGEKEURD BUDGET AJU'!$L$18","v":0},0,1,null,0,0,null,0]
[null,null,"mei",null,null,null,null,null,null,0,{"$f":"'GOEDGEKEURD BUDGET AJU'!$I$18","v":0},0,{"$f":"'GOEDGEKEURD BUDGET AJU'!$L$18","v":0},0,1,null,0,0,null,0]
[null,null,"juni",null,null,null,null,null,null,0,{"$f":"'GOEDGEKEURD BUDGET AJU'!$I$18","v":0},0,{"$f":"'GOEDGEKEURD BUDGET AJU'!$L$18","v":0},0,1,null,0,0,null,0]
[null,null,"Vakantiegeld",null,null,null,null,null,null,0,{"$f":"'GOEDGEKEURD BUDGET AJU'!$I$18","v":0},0,{"$f":"'GOEDGEKEURD BUDGET AJU'!$L$18","v":0},0,1,null,0,0,null,0]
[null,null,"juli",null,null,null,null,null,null,0,{"$f":"'GOEDGEKEURD BUDGET AJU'!$I$18","v":0},0,{"$f":"'GOEDGEKEURD BUDGET AJU'!$L$18","v":0},0,1,null,0,0,null,0]
[null,null,"augustus",null,null,null,null,null,null,0,{"$f":"'GOEDGEKEURD BUDGET AJU'!$I$18","v":0},0,{"$f":"'GOEDGEKEURD BUDGET AJU'!$L$18","v":0},0,1,null,0,0,null,0]
[null,null,"september",null,null,null,null,null,null,0,{"$f":"'GOEDGEKEURD BUDGET AJU'!$I$18","v":0},0,{"$f":"'GOEDGEKEURD BUDGET AJU'!$L$18","v":0},0,1,null,0,0,null,0]
[null,null,"oktober",null,null,null,null,null,null,0,{"$f":"'GOEDGEKEURD BUDGET AJU'!$I$18","v":0},0,{"$f":"'GOEDGEKEURD BUDGET AJU'!$L$18","v":0},0,1,null,0,0,null,0]
[null,null,"november",null,null,null,null,null,null,0,{"$f":"'GOEDGEKEURD BUDGET AJU'!$I$18","v":0},0,{"$f":"'GOEDGEKEURD BUDGET AJU'!$L$18","v":0},0,1,null,0,0,null,0]
[null,null,"december",null,null,null,null,null,null,0,{"$f":"'GOEDGEKEURD BUDGET AJU'!$I$18","v":0},0,{"$f":"'GOEDGEKEURD BUDGET AJU'!$L$18","v":0},0,1,null,0,0,null,0]
[null,null,"Eindejaarspremie",null,null,null,null,null,null,0,{"$f":"'GOEDGEKEURD BUDGET AJU'!$I$18","v":0},0,{"$f":"'GOEDGEKEURD BUDGET AJU'!$L$18","v":0},0,1,null,0,0,null,0]
[null,null,"TOTAAL",null,{"$f":"SUM(E54:E67)","v":0},{"$f":"SUM(F54:F67)","v":0},0,0,0,{"$f":"SUM(J54:J67)","v":0},null,{"$f":"SUM(L54:L67)","v":0},null,null,{"$f":"AVERAGE(O54:O67)","v":1},null,{"$f":"SUM(Q54:Q67)","v":0},null,null,{"$f":"SUM(T54:T67)","v":0},{"$f":"SUM(U55:U67)","v":0}]
[null,null,null,null,null,null,null,null,null,null,null,null,null,null,null,null,null,{"$f":"IFERROR(Q69/J69,0)","v":0}]
[null,{"$f":"'GOEDGEKEURD BUDGET AJU'!C19","v":"(naam in te vullen)"},"januari",null,null,null,null,null,null,{"$f":"+E70+F70+G70+H70+I70","v":0},{"$f":"'GOEDGEKEURD BUDGET AJU'!$I$19","v":0},{"$f":"+J70*K70","v":0},{"$f":"'GOEDGEKEURD BUDGET AJU'!$L$19","v":0},{"$f":"L70*M70","v":0},{"$f":"1-M70","v":1},null,{"$f":"L70-N70","v":0},0,null,0]
[null,null,"februari",null,null,null,null,null,null,0,{"$f":"'GOEDGEKEURD BUDGET AJU'!$I$19","v":0},{"$f":"+J71*K71","v":0},{"$f":"'GOEDGEKEURD BUDGET AJU'!$L$19","v":0},{"$f":"L71*0.89","v":0},{"$f":"1-M71","v":1},null,0,0,null,0]
[null,null,"maart",null,null,null,null,null,null,0,{"$f":"'GOEDGEKEURD BUDGET AJU'!$I$19","v":0},0,{"$f":"'GOEDGEKEURD BUDGET AJU'!$L$19","v":0},0,1,null,0,0,null,0]
[null,null,"april",null,null,null,null,null,null,0,{"$f":"'GOEDGEKEURD BUDGET AJU'!$I$19","v":0},0,{"$f":"'GOEDGEKEURD BUDGET AJU'!$L$19","v":0},0,1,null,0,0,null,0]
[null,null,"mei",null,null,null,null,null,null,0,{"$f":"'GOEDGEKEURD BUDGET AJU'!$I$19","v":0},0,{"$f":"'GOEDGEKEURD BUDGET AJU'!$L$19","v":0},0,1,null,0,0,null,0]
[null,null,"juni",null,null,null,null,null,null,0,{"$f":"'GOEDGEKEURD BUDGET AJU'!$I$19","v":0},0,{"$f":"'GOEDGEKEURD BUDGET AJU'!$L$19","v":0},0,1,null,0,0,null,0]
[null,null,"Vakantiegeld",null,null,null,null,null,null,0,{"$f":"'GOEDGEKEURD BUDGET AJU'!$I$19","v":0},0,{"$f":"'GOEDGEKEURD BUDGET AJU'!$L$19","v":0},0,1,null,0,0,null,0]
[null,null,"juli",null,null,null,null,null,null,0,{"$f":"'GOEDGEKEURD BUDGET AJU'!$I$19","v":0},0,{"$f":"'GOEDGEKEURD BUDGET AJU'!$L$19","v":0},0,1,null,0,0,null,0]
[null,null,"augustus",null,null,null,null,null,null,0,{"$f":"'GOEDGEKEURD BUDGET AJU'!$I$19","v":0},0,{"$f":"'GOEDGEKEURD BUDGET AJU'!$L$19","v":0},0,1,null,0,0,null,0]
[null,null,"september",null,null,null,null,null,null,0,{"$f":"'GOEDGEKEURD BUDGET AJU'!$I$19","v":0},0,{"$f":"'GOEDGEKEURD BUDGET AJU'!$L$19","v":0},0,1,null,0,0,null,0]
[null,null,"oktober",null,null,null,null,null,null,0,{"$f":"'GOEDGEKEURD BUDGET AJU'!$I$19","v":0},0,{"$f":"'GOEDGEKEURD BUDGET AJU'!$L$19","v":0},0,1,null,0,0,null,0]
[null,null,"november",null,null,null,null,null,null,0,{"$f":"'GOEDGEKEURD BUDGET AJU'!$I$19","v":0},0,{"$f":"'GOEDGEKEURD BUDGET AJU'!$L$19","v":0},0,1,null,0,0,null,0]
[null,null,"december",null,null,null,null,null,null,0,{"$f":"'GOEDGEKEURD BUDGET AJU'!$I$19","v":0},0,{"$f":"'GOEDGEKEURD BUDGET AJU'!$L$19","v":0},0,1,null,0,0,null,0]
[null,null,"Eindejaarspremie",null,null,null,null,null,null,0,{"$f":"'GOEDGEKEURD BUDGET AJU'!$I$19","v":0},0,{"$f":"'GOEDGEKEURD BUDGET AJU'!$L$19","v":0},0,1,null,0,0,null,0]
[null,null,"TOTAAL",null,{"$f":"SUM(E70:E83)","v":0},{"$f":"SUM(F70:F83)","v":0},0,0,0,{"$f":"SUM(J70:J83)","v":0},null,{"$f":"SUM(L70:L83)","v":0},null,null,{"$f":"AVERAGE(O70:O83)","v":1},null,{"$f":"SUM(Q70:Q83)","v":0},null,null,{"$f":"SUM(T70:T83)","v":0},{"$f":"SUM(U71:U83)","v":0}]
[null,null,null,null,null,null,null,null,null,null,null,null,null,null,null,null,null,{"$f":"IFERROR(Q85/J85,0)","v":0}]
[null,{"$f":"'GOEDGEKEURD BUDGET AJU'!C20","v":"(naam in te vullen)"},"januari",null,null,null,null,null,null,{"$f":"+E86+F86+G86+H86+I86","v":0},{"$f":"'GOEDGEKEURD BUDGET AJU'!$I$20","v":0},{"$f":"+J86*K86","v":0},{"$f":"'GOEDGEKEURD BUDGET AJU'!$L$20","v":0},{"$f":"L86*M86","v":0},{"$f":"1-M86","v":1},null,{"$f":"L86-N86","v":0},0,null,{"$f":"N86-U86","v":0}]
[null,null,"februari",null,null,null,null,null,null,0,{"$f":"'GOEDGEKEURD BUDGET AJU'!$I$20","v":0},{"$f":"+J87*K87","v":0},{"$f":"'GOEDGEKEURD BUDGET AJU'!$L$20","v":0},{"$f":"L87*0.89","v":0},{"$f":"1-M87","v":1},null,0,0,null,0]
[null,null,"maart",null,null,null,null,null,null,0,{"$f":"'GOEDGEKEURD BUDGET AJU'!$I$20","v":0},0,{"$f":"'GOEDGEKEURD BUDGET AJU'!$L$20","v":0},0,1,null,0,0,null,0]
[null,null,"april",null,null,null,null,null,null,0,{"$f":"'GOEDGEKEURD BUDGET AJU'!$I$20","v":0},0,{"$f":"'GOEDGEKEURD BUDGET AJU'!$L$20","v":0},0,1,null,0,0,null,0]
[null,null,"mei",null,null,null,null,null,null,0,{"$f":"'GOEDGEKEURD BUDGET AJU'!$I$20","v":0},0,{"$f":"'GOEDGEKEURD BUDGET AJU'!$L$20","v":0},0,1,null,0,0,null,0]
[null,null,"juni",null,null,null,null,null,null,0,{"$f":"'GOEDGEKEURD BUDGET AJU'!$I$20","v":0},0,{"$f":"'GOEDGEKEURD BUDGET AJU'!$L$20","v":0},0,1,null,0,0,null,0]
[null,null,"Vakantiegeld",null,null,null,null,null,null,0,{"$f":"'GOEDGEKEURD BUDGET AJU'!$I$20","v":0},0,{"$f":"'GOEDGEKEURD BUDGET AJU'!$L$20","v":0},0,1,null,0,0,null,0]
[null,null,"juli",null,null,null,null,null,null,0,{"$f":"'GOEDGEKEURD BUDGET AJU'!$I$20","v":0},0,{"$f":"'GOEDGEKEURD BUDGET AJU'!$L$20","v":0},0,1,null,0,0,null,0]
[null,null,"augustus",null,null,null,null,null,null,0,{"$f":"'GOEDGEKEURD BUDGET AJU'!$I$20","v":0},0,{"$f":"'GOEDGEKEURD BUDGET AJU'!$L$20","v":0},0,1,null,0,0,null,0]
[null,null,"september",null,null,null,null,null,null,0,{"$f":"'GOEDGEKEURD BUDGET AJU'!$I$20","v":0},0,{"$f":"'GOEDGEKEURD BUDGET AJU'!$L$20","v":0},0,1,null,0,0,null,0]
[null,null,"oktober",null,null,null,null,null,null,0,{"$f":"'GOEDGEKEURD BUDGET AJU'!$I$20","v":0},0,{"$f":"'GOEDGEKEURD BUDGET AJU'!$L$20","v":0},0,1,null,0,0,null,0]
[null,null,"november",null,null,null,null,null,null,0,{"$f":"'GOEDGEKEURD BUDGET AJU'!$I$20","v":0},0,{"$f":"'GOEDGEKEURD BUDGET AJU'!$L$20","v":0},0,1,null,0,0,null,0]
[null,null,"december",null,null,null,null,null,null,0,{"$f":"'GOEDGEKEURD BUDGET AJU'!$I$20","v":0},0,{"$f":"'GOEDGEKEURD BUDGET AJU'!$L$20","v":0},0,1,null,0,0,null,0]
[null,null,"Eindejaarspremie",null,null,null,null,null,null,0,{"$f":"'GOEDGEKEURD BUDGET AJU'!$I$20","v":0},0,{"$f":"'GOEDGEKEURD BUDGET AJU'!$L$20","v":0},0,1,null,0,0,null,0]
[null,null,"TOTAAL",null,{"$f":"SUM(E86:E99)","v":0},{"$f":"SUM(F86:F99)","v":0},0,0,0,0,null,{"$f":"SUM(L86:L99)","v":0},null,null,{"$f":"AVERAGE(O86:O99)","v":1},null,{"$f":"SUM(Q86:Q99)","v":0},null,null,{"$f":"SUM(T86:T99)","v":0},{"$f":"SUM(U87:U99)","v":0}]
[null,null,null,null,null,null,null,null,null,null,null,null,null,null,null,null,null,{"$f":"IFERROR(Q101/J101,0)","v":0}]
[null,{"$f":"'GOEDGEKEURD BUDGET AJU'!C21","v":"(naam in te vullen)"},"januari",null,null,null,null,null,null,{"$f":"+E102+F102+G102+H102+I102","v":0},{"$f":"'GOEDGEKEURD BUDGET AJU'!$I$21","v":0},{"$f":"+J102*K102","v":0},{"$f":"'GOEDGEKEURD BUDGET AJU'!$L$21","v":0},{"$f":"L102*M102","v":0},{"$f":"1-M102","v":1},null,{"$f":"L102-N102","v":0},0,null,{"$f":"N102-U102","v":0}]
[null,null,"februari",null,null,null,null,null,null,0,{"$f":"'GOEDGEKEURD BUDGET AJU'!$I$21","v":0},{"$f":"+J103*K103","v":0},{"$f":"'GOEDGEKEURD BUDGET AJU'!$L$21","v":0},{"$f":"L103*0.89","v":0},{"$f":"1-M103","v":1},null,0,0,null,0]
[null,null,"maart",null,null,null,null,null,null,0,{"$f":"'GOEDGEKEURD BUDGET AJU'!$I$21","v":0},0,{"$f":"'GOEDGEKEURD BUDGET AJU'!$L$21","v":0},0,1,null,0,0,null,0]
[null,null,"april",null,null,null,null,null,null,0,{"$f":"'GOEDGEKEURD BUDGET AJU'!$I$21","v":0},0,{"$f":"'GOEDGEKEURD BUDGET AJU'!$L$21","v":0},0,1,null,0,0,null,0]
[null,null,"mei",null,null,null,null,null,null,0,{"$f":"'GOEDGEKEURD BUDGET AJU'!$I$21","v":0},0,{"$f":"'GOEDGEKEURD BUDGET AJU'!$L$21","v":0},0,1,null,0,0,null,0]
[null,null,"juni",null,null,null,null,null,null,0,{"$f":"'GOEDGEKEURD BUDGET AJU'!$I$21","v":0},0,{"$f":"'GOEDGEKEURD BUDGET AJU'!$L$21","v":0},0,1,null,0,0,null,0]
[null,null,"Vakantiegeld",null,null,null,null,null,null,0,{"$f":"'GOEDGEKEURD BUDGET AJU'!$I$21","v":0},0,{"$f":"'GOEDGEKEURD BUDGET AJU'!$L$21","v":0},0,1,null,0,0,null,0]
[null,null,"juli",null,null,null,null,null,null,0,{"$f":"'GOEDGEKEURD BUDGET AJU'!$I$21","v":0},0,{"$f":"'GOEDGEKEURD BUDGET AJU'!$L$21","v":0},0,1,null,0,0,null,0]
[null,null,"augustus",null,null,null,null,null,null,0,{"$f":"'GOEDGEKEURD BUDGET AJU'!$I$21","v":0},0,{"$f":"'GOEDGEKEURD BUDGET AJU'!$L$21","v":0},0,1,null,0,0,null,0]
[null,null,"september",null,null,null,null,null,null,0,{"$f":"'GOEDGEKEURD BUDGET AJU'!$I$21","v":0},0,{"$f":"'GOEDGEKEURD BUDGET AJU'!$L$21","v":0},0,1,null,0,0,null,0]
[null,null,"oktober",null,null,null,null,null,null,0,{"$f":"'GOEDGEKEURD BUDGET AJU'!$I$21","v":0},0,{"$f":"'GOEDGEKEURD BUDGET AJU'!$L$21","v":0},0,1,null,0,0,null,0]
[null,null,"november",null,null,null,null,null,null,0,{"$f":"'GOEDGEKEURD BUDGET AJU'!$I$21","v":0},0,{"$f":"'GOEDGEKEURD BUDGET AJU'!$L$21","v":0},0,1,null,0,0,null,0]
[null,null,"december",null,null,null,null,null,null,0,{"$f":"'GOEDGEKEURD BUDGET AJU'!$I$21","v":0},0,{"$f":"'GOEDGEKEURD BUDGET AJU'!$L$21","v":0},0,1,null,0,0,null,0]
[null,null,"Eindejaarspremie",null,null,null,null,null,null,0,{"$f":"'GOEDGEKEURD BUDGET AJU'!$I$21","v":0},0,{"$f":"'GOEDGEKEURD BUDGET AJU'!$L$21","v":0},0,1,null,0,0,null,0]
[null,null,"TOTAAL",null,{"$f":"SUM(E102:E115)","v":0},{"$f":"SUM(F102:F115)","v":0},0,0,0,0,null,{"$f":"SUM(L102:L115)","v":0},null,null,{"$f":"AVERAGE(O102:O115)","v":1},null,{"$f":"SUM(Q102:Q115)","v":0},null,null,{"$f":"SUM(T102:T115)","v":0},{"$f":"SUM(U103:U115)","v":0}]
[null,null,null,null,null,null,null,null,null,null,null,null,null,null,null,null,null,{"$f":"IFERROR(Q117/J117,0)","v":0}]
[null,{"$f":"'GOEDGEKEURD BUDGET AJU'!C22","v":"(naam in te vullen)"},"januari",null,null,null,null,null,null,{"$f":"+E118+F118+G118+H118+I118","v":0},{"$f":"'GOEDGEKEURD BUDGET AJU'!$I$22","v":0},{"$f":"+J118*K118","v":0},{"$f":"'GOEDGEKEURD BUDGET AJU'!$L$22","v":0},{"$f":"L118*M118","v":0},{"$f":"1-M118","v":1},null,{"$f":"L118-N118","v":0},0,null,{"$f":"N118-U118","v":0}]
[null,null,"februari",null,null,null,null,null,null,0,{"$f":"'GOEDGEKEURD BUDGET AJU'!$I$22","v":0},{"$f":"+J119*K119","v":0},{"$f":"'GOEDGEKEURD BUDGET AJU'!$L$22","v":0},{"$f":"L119*0.89","v":0},{"$f":"1-M119","v":1},null,0,0,null,0]
[null,null,"maart",null,null,null,null,null,null,0,{"$f":"'GOEDGEKEURD BUDGET AJU'!$I$22","v":0},0,{"$f":"'GOEDGEKEURD BUDGET AJU'!$L$22","v":0},0,1,null,0,0,null,0]
[null,null,"april",null,null,null,null,null,null,0,{"$f":"'GOEDGEKEURD BUDGET AJU'!$I$22","v":0},0,{"$f":"'GOEDGEKEURD BUDGET AJU'!$L$22","v":0},0,1,null,0,0,null,0]
[null,null,"mei",null,null,null,null,null,null,0,{"$f":"'GOEDGEKEURD BUDGET AJU'!$I$22","v":0},0,{"$f":"'GOEDGEKEURD BUDGET AJU'!$L$22","v":0},0,1,null,0,0,null,0]
[null,null,"juni",null,null,null,null,null,null,0,{"$f":"'GOEDGEKEURD BUDGET AJU'!$I$22","v":0},0,{"$f":"'GOEDGEKEURD BUDGET AJU'!$L$22","v":0},0,1,null,0,0,null,0]
[null,null,"Vakantiegeld",null,null,null,null,null,null,0,{"$f":"'GOEDGEKEURD BUDGET AJU'!$I$22","v":0},0,{"$f":"'GOEDGEKEURD BUDGET AJU'!$L$22","v":0},0,1,null,0,0,null,0]
[null,null,"juli",null,null,null,null,null,null,0,{"$f":"'GOEDGEKEURD BUDGET AJU'!$I$22","v":0},0,{"$f":"'GOEDGEKEURD BUDGET AJU'!$L$22","v":0},0,1,null,0,0,null,0]
[null,null,"augustus",null,null,null,null,null,null,0,{"$f":"'GOEDGEKEURD BUDGET AJU'!$I$22","v":0},0,{"$f":"'GOEDGEKEURD BUDGET AJU'!$L$22","v":0},0,1,null,0,0,null,0]
[null,null,"september",null,null,null,null,null,null,0,{"$f":"'GOEDGEKEURD BUDGET AJU'!$I$22","v":0},0,{"$f":"'GOEDGEKEURD BUDGET AJU'!$L$22","v":0},0,1,null,0,0,null,0]
[null,null,"oktober",null,null,null,null,null,null,0,{"$f":"'GOEDGEKEURD BUDGET AJU'!$I$22","v":0},0,{"$f":"'GOEDGEKEURD BUDGET AJU'!$L$22","v":0},0,1,null,0,0,null,0]
[null,null,"november",null,null,null,null,null,null,0,{"$f":"'GOEDGEKEURD BUDGET AJU'!$I$22","v":0},0,{"$f":"'GOEDGEKEURD BUDGET AJU'!$L$22","v":0},0,1,null,0,0,null,0]
[null,null,"december",null,null,null,null,null,null,0,{"$f":"'GOEDGEKEURD BUDGET AJU'!$I$22","v":0},0,{"$f":"'GOEDGEKEURD BUDGET AJU'!$L$22","v":0},0,1,null,0,0,null,0]
[null,null,"Eindejaarspremie",null,null,null,null,null,null,0,{"$f":"'GOEDGEKEURD BUDGET AJU'!$I$22","v":0},0,{"$f":"'GOEDGEKEURD BUDGET AJU'!$L$22","v":0},0,1,null,0,0,null,0]
[null,null,"TOTAAL",null,{"$f":"SUM(E118:E131)","v":0},{"$f":"SUM(F118:F131)","v":0},0,0,0,0,null,{"$f":"SUM(L118:L131)","v":0},{"$f":"IFERROR(N132/L132,0)","v":0},{"$f":"SUM(N118:N131)","v":0},{"$f":"AVERAGE(O118:O131)","v":1},null,{"$f":"SUM(Q118:Q131)","v":0},null,null,{"$f":"SUM(T118:T131)","v":0},{"$f":"SUM(U119:U131)","v":0}]
["TOTAAL GOEDGEKEURD BUDGET",null,{"$f":"'GOEDGEKEURD BUDGET AJU'!K23","v":0},null,null,null,null,null,null,null,"TOTAAL WERKELIJKE KOSTEN",null,null,{"$f":"N132+N116+N100+N84+N68+N52+N36+N20","v":0},null,null,{"$f":"Q20+Q36+Q52+Q68+Q84+Q100+Q116+Q132","v":0},null,null,{"$f":"T20+T36+T52+T68+T84+T100+T116+T132","v":0},{"$f":"U20+U36+U52+U68+U84+U100+U116+U132","v":0}]
[]
[]
[]
["2. Checklist Personeelskosten"]
[]
[null,"Zijn de individuele loonfiches (of een ander door een derde instantie gegenereerd document die deze kosten kunnen certificeren) per aangegeven personeelslid aanwezig"]
[null,"Zijn alle kosten duidelijk en eenvoudig terug te vinden in de toegevoegde bewijzen?"]
[null,"Is de naam van het personeelslid toegewezen aan het project ingevuld in kolom B? "]
[null,"Zijn de verschillende kosten dmv optelsommen terug te vinden in de verschillende kolommen"]

{"sheet":"Huur","index":12,"n_rows":26,"n_cols":16,"rows_kept":26,"cut":false,"hidden":true,"merged":[[29,1,29,10],[22,0,23,10],[24,1,24,10],[25,1,25,10],[26,1,26,10],[27,1,27,10],[18,7,19,7],[18,8,19,8],[0,12,2,15],[18,15,19,15],[28,1,28,10],[18,0,19,2],[18,3,19,3],[18,12,19,12],[18,13,19,13],[18,14,19,14],[18,4,19,6],[18,9,19,9]]}
["Huur",null,null,"Alle cijfers moeten gemakkelijk terug te vinden zijn in de geleverde bewijsstukken. Indien niet, gelieve meer uitleg te verschaffen bij de opmerkingen",null,null,null,null,null,null,null,null,"INPUT FEDASIL"]
[]
["1. Detail kosten"]
[]
["Doc. nr.","Datum factuur","Projectcode","verhuurder","Omschrijving","Huurwaarde (100%)                       (A)","% Fedasil financiering  [C]","Totale kost Fedasil\n(A)* [C]","Opmerkingen","Andere financierings-bronnen reële uitgaven","% andere bronnen",null,"Subsidiabel Fedasil","Niet subsidiabel","Opmerkingen FEDASIL na controle","Extra input OPE FEDASIL na controle"]
[null,null,null,null,null,null,{"$f":"'GOEDGEKEURD BUDGET AJU'!$L$25","v":0},{"$f":"+F6*G6","v":0},null,{"$f":"F6-H6","v":0},{"$f":"IFERROR(+J6/F6,0)","v":0},null,{"$f":"H6-N6","v":0}]
[null,null,null,null,null,null,{"$f":"'GOEDGEKEURD BUDGET AJU'!$L$25","v":0},{"$f":"+F7*G7","v":0},null,0,{"$f":"IFERROR(+J7/F7,0)","v":0},null,{"$f":"H7-N7","v":0}]
[null,null,null,null,null,null,{"$f":"'GOEDGEKEURD BUDGET AJU'!$L$25","v":0},0,null,0,0,null,0]
[null,null,null,null,null,null,{"$f":"'GOEDGEKEURD BUDGET AJU'!$L$25","v":0},0,null,0,0,null,0]
[null,null,null,null,null,null,{"$f":"'GOEDGEKEURD BUDGET AJU'!$L$25","v":0},0,null,0,0,null,0]
[null,null,null,null,null,null,{"$f":"'GOEDGEKEURD BUDGET AJU'!$L$25","v":0},0,null,0,0,null,0]
[null,null,null,null,null,null,{"$f":"'GOEDGEKEURD BUDGET AJU'!$L$25","v":0},0,null,0,0,null,0]
[null,null,null,null,null,null,{"$f":"'GOEDGEKEURD BUDGET AJU'!$L$25","v":0},0,null,0,0,null,0]
[null,null,null,null,null,null,{"$f":"'GOEDGEKEURD BUDGET AJU'!$L$25","v":0},0,null,0,0,null,0]
[null,null,null,null,null,null,{"$f":"'GOEDGEKEURD BUDGET AJU'!$L$25","v":0},0,null,0,0,null,0]
[null,null,null,null,null,null,{"$f":"'GOEDGEKEURD BUDGET AJU'!$L$25","v":0},0,null,0,0,null,0]
[null,null,null,null,null,null,{"$f":"'GOEDGEKEURD BUDGET AJU'!$L$25","v":0},0,null,0,0,null,0]
[null,null,null,null,null,null,"TOTAAL",{"$f":"SUM(H6:H17)","v":0},null,{"$f":"SUM(J6:J17)","v":0}]
["TOTAAL GOEDGEKEURD BUDGET",null,null,{"$f":"'GOEDGEKEURD BUDGET AJU'!K26","v":0},"TOTAAL WERKELIJKE KOSTEN",null,null,{"$f":"SUM(H18)","v":0},null,{"$f":"SUM(J18)","v":0},null,null,{"$f":"+M18","v":0},{"$f":"+N18","v":0}]
[]
[]
[]
["2. Checklist Huur"]
[]
[null,"Zijn de nodige bewijzen betreffende de huurkost toegewezen aan het project aanwezig?"]
[null,"Is de verdeelsleutel goed toegepast en duidelijk uitgelegd? "]

{"sheet":"Investeringen","index":13,"n_rows":19,"n_cols":18,"rows_kept":19,"cut":false,"hidden":true,"merged":[[9,10,10,10],[9,11,10,11],[0,14,2,17],[9,17,10,17],[20,1,20,12],[13,0,14,10],[9,14,10,14],[9,15,10,15],[9,16,10,16],[15,1,15,12],[16,1,16,12],[17,1,17,12],[18,1,18,12],[19,1,19,12],[9,0,10,2],[9,3,10,3],[9,7,10,9]]}
["Investeringen",null,null,"Alle cijfers moeten gemakkelijk terug te vinden zijn in de geleverde bewijsstukken. Indien niet, gelieve meer uitleg te verschaffen bij de opmerkingen",null,null,null,null,null,null,null,null,null,null,"INPUT FEDASIL"]
[]
["1. Detail kosten"]
[]
["Doc. nr.","Datum factuur","Projectcode","Naam van de leverancier","Investering","\nOmschrijving van de uitgave en de link met het project aangeven indien > 500 euro             ","Aankoopwaarde  of Leasingwaarde (100%)                      ","Aaantal afschrijvings-jaren","Afgeschreven bedrag","% Fedasil financiering","Bedrag Fedasil-financiering\n","Andere financierings-bronnen reële uitgaven","% andere bronnen",null,"Subsidiabel Fedasil","Niet subsidiabel","Opmerkingen FEDASIL na controle","Extra input OPE FEDASIL na controle"]
[null,null,null,null,{"$f":"'GOEDGEKEURD BUDGET AJU'!C28","v":"(Beschrijving in te vullen)"},null,null,null,{"$f":"IFERROR(+G6/H6,0)","v":0},{"$f":"'GOEDGEKEURD BUDGET AJU'!L28","v":0},{"$f":"+I6*J6","v":0},{"$f":"I6-K6","v":0},{"$f":"IFERROR(L6/I6,0)","v":0},null,{"$f":"J6-P6","v":0}]
[null,null,null,null,{"$f":"'GOEDGEKEURD BUDGET AJU'!C29","v":"(in te vullen)"},null,null,null,{"$f":"IFERROR(+G7/H7,0)","v":0},{"$f":"'GOEDGEKEURD BUDGET AJU'!L29","v":0},{"$f":"+I7*J7","v":0},{"$f":"I7-K7","v":0},{"$f":"IFERROR(L7/I7,0)","v":0},null,{"$f":"J7-P7","v":0}]
[null,null,null,null,{"$f":"'GOEDGEKEURD BUDGET AJU'!C30","v":"(in te vullen)"},null,null,null,0,{"$f":"'GOEDGEKEURD BUDGET AJU'!L30","v":0},0,{"$f":"I8-K8","v":0},0,null,0]
[null,null,null,null,{"$f":"'GOEDGEKEURD BUDGET AJU'!C31","v":"(in te vullen)"},null,null,null,0,{"$f":"'GOEDGEKEURD BUDGET AJU'!L31","v":0},0,0,0,null,0]
["TOTAAL GOEDGEKEURD BUDGET",null,null,{"$f":"'GOEDGEKEURD BUDGET AJU'!K32","v":0},null,null,null,"TOTAAL WERKELIJKE KOSTEN",null,null,{"$f":"SUM(K6:K9)","v":0},{"$f":"SUM(L6:L9)","v":0},null,null,{"$f":"O6+O7+O8+O9","v":0},{"$f":"P6+P7+P8+P9","v":0}]
[]
[]
[]
["2. Checklist Investeringen"]
[]
[null,"Zijn de nodige bewijzen betreffende de investeringskosten toegewezen op het project aanwezig?"]
[null,"Is de verdeelsleutel goed toegepast en duidelijk uitgelegd? "]
[null,"Zijn de uitgaven gedaan binnen de subsidiabiliteitsperiode?"]
[null,"Zijn de afschrijvingsregels gerespecteerd? In functie van de aankoopdatum?"]

{"sheet":"Directe werkingskosten","index":14,"n_rows":157,"n_cols":21,"rows_kept":157,"cut":false,"hidden":true,"merged":[[156,1,156,10],[157,1,157,10],[158,1,158,10],[159,1,159,10],[122,3,133,3],[135,3,146,3],[152,0,153,10],[154,1,154,10],[155,1,155,10],[0,5,0,10],[148,0,149,2],[148,3,149,3],[148,6,149,7],[148,8,149,8],[148,9,149,9],[148,5,149,5],[5,3,16,3],[18,3,29,3],[31,3,42,3],[44,3,55,3],[57,3,68,3],[70,3,81,3],[83,3,94,3],[96,3,107,3],[109,3,120,3],[0,12,2,14],[148,12,149,12],[148,13,149,13],[148,14,149,14],[0,17,2,20]]}
["Directe werkingskosten",null,null,null,null,"Alle cijfers moeten gemakkelijk terug te vinden zijn in de geleverde bewijsstukken. Indien niet, gelieve meer uitleg \nte verschaffen bij de opmerkingen",null,null,null,null,null,null,"INPUT FEDASIL",null,null,null,null,"INPUT FEDASIL"]
[]
["1. Detail kosten"]
[]
["Doc. nr.","Datum factuur","Projectcode","Subrubriek","Naam van de leverancier","Een korte omschrijving voor uitgaven < €500 euro en een meer gedetailleerde omschrijving en motivatie voor uitgaven > € 500 euro.","Totaal factuurbedrag","% Fedasil financiering","Bedrag Fedasil-financiering\n","Andere financierings-bronnen reële uitgaven","% andere bronnen",null,"Subsidiabel Fedasil","Niet subsidiabel","Opmerkingen FEDASIL na controle",null,null,"Subsidiabel Fedasil","Niet subsidiabel","Opmerkingen FEDASIL na controle","Extra input OPE FEDASIL na controle"]
[null,null,null,{"$f":"CONCATENATE('GOEDGEKEURD BUDGET AJU'!C34,'GOEDGEKEURD BUDGET AJU'!E34)","v":"Kies uit lijst Directe Werkingskosten "},null,null,null,{"$f":"'GOEDGEKEURD BUDGET AJU'!$L$34","v":0},{"$f":"G6*H6","v":0},{"$f":"G6-I6","v":0},{"$f":"IFERROR(+J6/G6,0)","v":0},null,{"$f":"I6-N6","v":0},null,null,null,null,{"$f":"M6-S6","v":0}]
[null,null,null,null,null,null,null,{"$f":"'GOEDGEKEURD BUDGET AJU'!$L$34","v":0},{"$f":"G7*H7","v":0},{"$f":"G7-I7","v":0},{"$f":"IFERROR(+J7/G7,0)","v":0},null,{"$f":"I7-N7","v":0},null,null,null,null,{"$f":"M7-S7","v":0}]
[null,null,null,null,null,null,null,{"$f":"'GOEDGEKEURD BUDGET AJU'!$L$34","v":0},0,0,0,null,0,null,null,null,null,0]
[null,null,null,null,null,null,null,{"$f":"'GOEDGEKEURD BUDGET AJU'!$L$34","v":0},0,0,0,null,0,null,null,null,null,0]
[null,null,null,null,null,null,null,{"$f":"'GOEDGEKEURD BUDGET AJU'!$L$34","v":0},0,0,0,null,0,null,null,null,null,0]
[null,null,null,null,null,null,null,{"$f":"'GOEDGEKEURD BUDGET AJU'!$L$34","v":0},0,0,0,null,0,null,null,null,null,0]
[null,null,null,null,null,null,null,{"$f":"'GOEDGEKEURD BUDGET AJU'!$L$34","v":0},0,0,0,null,0,null,null,null,null,0]
[null,null,null,null,null,null,null,{"$f":"'GOEDGEKEURD BUDGET AJU'!$L$34","v":0},0,0,0,null,0,null,null,null,null,0]
[null,null,null,null,null,null,null,{"$f":"'GOEDGEKEURD BUDGET AJU'!$L$34","v":0},{"$f":"G14*H14","v":0},{"$f":"G14-I14","v":0},{"$f":"IFERROR(+J14/G14,0)","v":0},null,{"$f":"I14-N14","v":0},null,null,null,null,{"$f":"M14-S14","v":0}]
[null,null,null,null,null,null,null,{"$f":"'GOEDGEKEURD BUDGET AJU'!$L$34","v":0},0,0,0,null,0,null,null,null,null,0]
[null,null,null,null,null,null,null,{"$f":"'GOEDGEKEURD BUDGET AJU'!$L$34","v":0},0,0,0,null,0,null,null,null,null,0]
[null,null,null,null,null,null,null,{"$f":"'GOEDGEKEURD BUDGET AJU'!$L$34","v":0},0,0,0,null,0,null,null,null,null,0]
[null,null,null,null,null,null,"TOTAAL",null,{"$f":"SUM(I6:I17)","v":0},{"$f":"SUM(J6:J17)","v":0},null,null,{"$f":"SUM(M6:M17)","v":0},{"$f":"SUM(N6:N17)","v":0},null,null,null,{"$f":"SUM(R6:R17)","v":0},{"$f":"SUM(S6:S17)","v":0}]
[null,null,null,{"$f":"CONCATENATE('GOEDGEKEURD BUDGET AJU'!C35,'GOEDGEKEURD BUDGET AJU'!E35)","v":"Kies uit lijst Directe Werkingskosten "},null,null,null,{"$f":"'GOEDGEKEURD BUDGET AJU'!$L$35","v":0},0,0,0,null,{"$f":"I19-N19","v":0},null,null,null,null,0]
[null,null,null,null,null,null,null,{"$f":"'GOEDGEKEURD BUDGET AJU'!$L$35","v":0},0,0,0,null,{"$f":"I20-N20","v":0},null,null,null,null,0]
[null,null,null,null,null,null,null,{"$f":"'GOEDGEKEURD BUDGET AJU'!$L$35","v":0},0,0,0,null,0,null,null,null,null,0]
[null,null,null,null,null,null,null,{"$f":"'GOEDGEKEURD BUDGET AJU'!$L$35","v":0},0,0,0,null,{"$f":"I22-N22","v":0},null,null,null,null,0]
[null,null,null,null,null,null,null,{"$f":"'GOEDGEKEURD BUDGET AJU'!$L$35","v":0},{"$f":"G23*H23","v":0},{"$f":"G23-I23","v":0},{"$f":"IFERROR(+J23/G23,0)","v":0},null,{"$f":"I23-N23","v":0},null,null,null,null,{"$f":"M23-S23","v":0}]
[null,null,null,null,null,null,null,{"$f":"'GOEDGEKEURD BUDGET AJU'!$L$35","v":0},0,0,0,null,0,null,null,null,null,0]
[null,null,null,null,null,null,null,{"$f":"'GOEDGEKEURD BUDGET AJU'!$L$35","v":0},0,0,0,null,0,null,null,null,null,0]
[null,null,null,null,null,null,null,{"$f":"'GOEDGEKEURD BUDGET AJU'!$L$35","v":0},0,0,0,null,0,null,null,null,null,0]
[null,null,null,null,null,null,null,{"$f":"'GOEDGEKEURD BUDGET AJU'!$L$35","v":0},0,0,0,null,0,null,null,null,null,0]
[null,null,null,null,null,null,null,{"$f":"'GOEDGEKEURD BUDGET AJU'!$L$35","v":0},0,0,0,null,0,null,null,null,null,0]
[null,null,null,null,null,null,null,{"$f":"'GOEDGEKEURD BUDGET AJU'!$L$35","v":0},0,0,0,null,0,null,null,null,null,0]
[null,null,null,null,null,null,null,{"$f":"'GOEDGEKEURD BUDGET AJU'!$L$35","v":0},0,0,0,null,0,null,null,null,null,0]
[null,null,null,null,null,null,"TOTAAL",null,{"$f":"SUM(I19:I30)","v":0},{"$f":"SUM(J19:J30)","v":0},null,null,{"$f":"SUM(M19:M30)","v":0},{"$f":"SUM(N19:N30)","v":0},null,null,null,{"$f":"SUM(R19:R30)","v":0},{"$f":"SUM(S19:S30)","v":0}]
[null,null,null,{"$f":"CONCATENATE('GOEDGEKEURD BUDGET AJU'!C36,'GOEDGEKEURD BUDGET AJU'!E36)","v":"Kies uit lijst Directe Werkingskosten "},null,null,null,{"$f":"'GOEDGEKEURD BUDGET AJU'!$L$36","v":0},{"$f":"G32*H32","v":0},0,0,null,{"$f":"I32-N32","v":0},null,null,null,null,0]
[null,null,null,null,null,null,null,{"$f":"'GOEDGEKEURD BUDGET AJU'!$L$36","v":0},0,0,0,null,{"$f":"I33-N33","v":0},null,null,null,null,0]
[null,null,null,null,null,null,null,{"$f":"'GOEDGEKEURD BUDGET AJU'!$L$36","v":0},{"$f":"G34*H34","v":0},{"$f":"G34-I34","v":0},{"$f":"IFERROR(+J34/G34,0)","v":0},null,{"$f":"I34-N34","v":0},null,null,null,null,{"$f":"M34-S34","v":0}]
[null,null,null,null,null,null,null,{"$f":"'GOEDGEKEURD BUDGET AJU'!$L$36","v":0},0,0,0,null,0,null,null,null,null,0]
[null,null,null,null,null,null,null,{"$f":"'GOEDGEKEURD BUDGET AJU'!$L$36","v":0},0,0,0,null,0,null,null,null,null,0]
[null,null,null,null,null,null,null,{"$f":"'GOEDGEKEURD BUDGET AJU'!$L$36","v":0},0,0,0,null,0,null,null,null,null,0]
[null,null,null,null,null,null,null,{"$f":"'GOEDGEKEURD BUDGET AJU'!$L$36","v":0},0,0,0,null,0,null,null,null,null,0]
[null,null,null,null,null,null,null,{"$f":"'GOEDGEKEURD BUDGET AJU'!$L$36","v":0},0,0,0,null,0,null,null,null,null,0]
[null,null,null,null,null,null,null,{"$f":"'GOEDGEKEURD BUDGET AJU'!$L$36","v":0},0,0,0,null,0,null,null,null,null,0]
[null,null,null,null,null,null,null,{"$f":"'GOEDGEKEURD BUDGET AJU'!$L$36","v":0},0,0,0,null,0,null,null,null,null,0]
[null,null,null,null,null,null,null,{"$f":"'GOEDGEKEURD BUDGET AJU'!$L$36","v":0},0,0,0,null,0,null,null,null,null,0]
[null,null,null,null,null,null,null,{"$f":"'GOEDGEKEURD BUDGET AJU'!$L$36","v":0},0,0,0,null,0,null,null,null,null,0]
[null,null,null,null,null,null,"TOTAAL",null,{"$f":"SUM(I32:I43)","v":0},{"$f":"SUM(J32:J43)","v":0},null,null,{"$f":"SUM(M32:M43)","v":0},{"$f":"SUM(N32:N43)","v":0},null,null,null,{"$f":"SUM(R32:R43)","v":0},{"$f":"SUM(S32:S43)","v":0}]
[null,null,null,{"$f":"CONCATENATE('GOEDGEKEURD BUDGET AJU'!C37,'GOEDGEKEURD BUDGET AJU'!E37)","v":"Kies uit lijst Directe Werkingskosten "},null,null,null,{"$f":"'GOEDGEKEURD BUDGET AJU'!$L$37","v":0},{"$f":"G45*H45","v":0},0,0,null,{"$f":"I45-N45","v":0},null,null,null,null,0]
[null,null,null,null,null,null,null,{"$f":"'GOEDGEKEURD BUDGET AJU'!$L$37","v":0},0,0,0,null,{"$f":"I46-N46","v":0},null,null,null,null,0]
[null,null,null,null,null,null,null,{"$f":"'GOEDGEKEURD BUDGET AJU'!$L$37","v":0},0,0,0,null,0,null,null,null,null,0]
[null,null,null,null,null,null,null,{"$f":"'GOEDGEKEURD BUDGET AJU'!$L$37","v":0},{"$f":"G48*H48","v":0},{"$f":"G48-I48","v":0},{"$f":"IFERROR(+J48/G48,0)","v":0},null,{"$f":"I48-N48","v":0},null,null,null,null,{"$f":"M48-S48","v":0}]
[null,null,null,null,null,null,null,{"$f":"'GOEDGEKEURD BUDGET AJU'!$L$37","v":0},0,0,0,null,0,null,null,null,null,0]
[null,null,null,null,null,null,null,{"$f":"'GOEDGEKEURD BUDGET AJU'!$L$37","v":0},0,0,0,null,0,null,null,null,null,0]
[null,null,null,null,null,null,null,{"$f":"'GOEDGEKEURD BUDGET AJU'!$L$37","v":0},0,0,0,null,0,null,null,null,null,0]
[null,null,null,null,null,null,null,{"$f":"'GOEDGEKEURD BUDGET AJU'!$L$37","v":0},0,0,0,null,0,null,null,null,null,0]
[null,null,null,null,null,null,null,{"$f":"'GOEDGEKEURD BUDGET AJU'!$L$37","v":0},0,0,0,null,0,null,null,null,null,0]
[null,null,null,null,null,null,null,{"$f":"'GOEDGEKEURD BUDGET AJU'!$L$37","v":0},0,0,0,null,0,null,null,null,null,0]
[null,null,null,null,null,null,null,{"$f":"'GOEDGEKEURD BUDGET AJU'!$L$37","v":0},0,0,0,null,0,null,null,null,null,0]
[null,null,null,null,null,null,null,{"$f":"'GOEDGEKEURD BUDGET AJU'!$L$37","v":0},0,0,0,null,0,null,null,null,null,0]
[null,null,null,null,null,null,"TOTAAL",null,{"$f":"SUM(I45:I56)","v":0},{"$f":"SUM(J45:J56)","v":0},null,null,{"$f":"SUM(M45:M56)","v":0},{"$f":"SUM(N45:N56)","v":0},null,null,null,{"$f":"SUM(R45:R56)","v":0},{"$f":"SUM(S45:S56)","v":0}]
[null,null,null,{"$f":"CONCATENATE('GOEDGEKEURD BUDGET AJU'!C38,'GOEDGEKEURD BUDGET AJU'!E38)","v":"Kies uit lijst Directe Werkingskosten "},null,null,null,{"$f":"'GOEDGEKEURD BUDGET AJU'!$L$38","v":0},{"$f":"G58*H58","v":0},0,0,null,{"$f":"I58-N58","v":0},null,null,null,null,0]
[null,null,null,null,null,null,null,{"$f":"'GOEDGEKEURD BUDGET AJU'!$L$38","v":0},0,0,0,null,{"$f":"I59-N59","v":0},null,null,null,null,0]
[null,null,null,null,null,null,null,{"$f":"'GOEDGEKEURD BUDGET AJU'!$L$38","v":0},0,0,0,null,0,null,null,null,null,0]
[null,null,null,null,null,null,null,{"$f":"'GOEDGEKEURD BUDGET AJU'!$L$38","v":0},{"$f":"G61*H61","v":0},{"$f":"G61-I61","v":0},{"$f":"IFERROR(+J61/G61,0)","v":0},null,{"$f":"I61-N61","v":0},null,null,null,null,{"$f":"M61-S61","v":0}]
[null,null,null,null,null,null,null,{"$f":"'GOEDGEKEURD BUDGET AJU'!$L$38","v":0},0,0,0,null,0,null,null,null,null,0]
[null,null,null,null,null,null,null,{"$f":"'GOEDGEKEURD BUDGET AJU'!$L$38","v":0},0,0,0,null,0,null,null,null,null,0]
[null,null,null,null,null,null,null,{"$f":"'GOEDGEKEURD BUDGET AJU'!$L$38","v":0},0,0,0,null,0,null,null,null,null,0]
[null,null,null,null,null,null,null,{"$f":"'GOEDGEKEURD BUDGET AJU'!$L$38","v":0},0,0,0,null,0,null,null,null,null,0]
[null,null,null,null,null,null,null,{"$f":"'GOEDGEKEURD BUDGET AJU'!$L$38","v":0},0,0,0,null,0,null,null,null,null,0]
[null,null,null,null,null,null,null,{"$f":"'GOEDGEKEURD BUDGET AJU'!$L$38","v":0},0,0,0,null,0,null,null,null,null,0]
[null,null,null,null,null,null,null,{"$f":"'GOEDGEKEURD BUDGET AJU'!$L$38","v":0},0,0,0,null,0,null,null,null,null,0]
[null,null,null,null,null,null,null,{"$f":"'GOEDGEKEURD BUDGET AJU'!$L$38","v":0},0,0,0,null,0,null,null,null,null,0]
[null,null,null,null,null,null,"TOTAAL",null,{"$f":"SUM(I58:I69)","v":0},{"$f":"SUM(J58:J69)","v":0},null,null,{"$f":"SUM(M58:M69)","v":0},{"$f":"SUM(N58:N69)","v":0},null,null,null,{"$f":"SUM(R58:R69)","v":0},{"$f":"SUM(S58:S69)","v":0}]
[null,null,null,{"$f":"CONCATENATE('GOEDGEKEURD BUDGET AJU'!C39,'GOEDGEKEURD BUDGET AJU'!E39)","v":"Kies uit lijst Directe Werkingskosten "},null,null,null,{"$f":"'GOEDGEKEURD BUDGET AJU'!$L$39","v":0},{"$f":"G71*H71","v":0},0,0,null,{"$f":"I71-N71","v":0},null,null,null,null,0]
[null,null,null,null,null,null,null,{"$f":"'GOEDGEKEURD BUDGET AJU'!$L$39","v":0},0,0,0,null,{"$f":"I72-N72","v":0},null,null,null,null,0]
[null,null,null,null,null,null,null,{"$f":"'GOEDGEKEURD BUDGET AJU'!$L$39","v":0},0,0,0,null,0,null,null,null,null,0]
[null,null,null,null,null,null,null,{"$f":"'GOEDGEKEURD BUDGET AJU'!$L$39","v":0},0,0,0,null,{"$f":"I74-N74","v":0},null,null,null,null,0]
[null,null,null,null,null,null,null,{"$f":"'GOEDGEKEURD BUDGET AJU'!$L$39","v":0},{"$f":"G75*H75","v":0},{"$f":"G75-I75","v":0},{"$f":"IFERROR(+J75/G75,0)","v":0},null,{"$f":"I75-N75","v":0},null,null,null,null,{"$f":"M75-S75","v":0}]
[null,null,null,null,null,null,null,{"$f":"'GOEDGEKEURD BUDGET AJU'!$L$39","v":0},0,0,0,null,0,null,null,null,null,0]
[null,null,null,null,null,null,null,{"$f":"'GOEDGEKEURD BUDGET AJU'!$L$39","v":0},0,0,0,null,0,null,null,null,null,0]
[null,null,null,null,null,null,null,{"$f":"'GOEDGEKEURD BUDGET AJU'!$L$39","v":0},0,0,0,null,0,null,null,null,null,0]
[null,null,null,null,null,null,null,{"$f":"'GOEDGEKEURD BUDGET AJU'!$L$39","v":0},0,0,0,null,0,null,null,null,null,0]
[null,null,null,null,null,null,null,{"$f":"'GOEDGEKEURD BUDGET AJU'!$L$39","v":0},0,{"$f":"G80-I80","v":0},{"$f":"IFERROR(+J80/G80,0)","v":0},null,0,null,null,null,null,{"$f":"M80-S80","v":0}]
[null,null,null,null,null,null,null,{"$f":"'GOEDGEKEURD BUDGET AJU'!$L$39","v":0},0,0,0,null,0,null,null,null,null,0]
[null,null,null,null,null,null,null,{"$f":"'GOEDGEKEURD BUDGET AJU'!$L$39","v":0},0,0,0,null,0,null,null,null,null,0]
[null,null,null,null,null,null,"TOTAAL",null,{"$f":"SUM(I71:I82)","v":0},{"$f":"SUM(J71:J82)","v":0},null,null,{"$f":"SUM(M71:M82)","v":0},{"$f":"SUM(N71:N82)","v":0},null,null,null,{"$f":"SUM(R71:R82)","v":0},{"$f":"SUM(S71:S82)","v":0}]
[null,null,null,{"$f":"CONCATENATE('GOEDGEKEURD BUDGET AJU'!C40,'GOEDGEKEURD BUDGET AJU'!E40)","v":"Kies uit lijst Directe Werkingskosten "},null,null,null,{"$f":"'GOEDGEKEURD BUDGET AJU'!$L$40","v":0},{"$f":"G84*H84","v":0},0,0,null,{"$f":"I84-N84","v":0},null,null,null,null,0]
[null,null,null,null,null,null,null,{"$f":"'GOEDGEKEURD BUDGET AJU'!$L$40","v":0},0,0,0,null,{"$f":"I85-N85","v":0},null,null,null,null,0]
[null,null,null,null,null,null,null,{"$f":"'GOEDGEKEURD BUDGET AJU'!$L$40","v":0},{"$f":"G86*H86","v":0},{"$f":"G86-I86","v":0},{"$f":"IFERROR(+J86/G86,0)","v":0},null,{"$f":"I86-N86","v":0},null,null,null,null,{"$f":"M86-S86","v":0}]
[null,null,null,null,null,null,null,{"$f":"'GOEDGEKEURD BUDGET AJU'!$L$40","v":0},0,0,0,null,0,null,null,null,null,0]
[null,null,null,null,null,null,null,{"$f":"'GOEDGEKEURD BUDGET AJU'!$L$40","v":0},0,0,0,null,0,null,null,null,null,0]
[null,null,null,null,null,null,null,{"$f":"'GOEDGEKEURD BUDGET AJU'!$L$40","v":0},0,0,0,null,0,null,null,null,null,0]
[null,null,null,null,null,null,null,{"$f":"'GOEDGEKEURD BUDGET AJU'!$L$40","v":0},0,0,0,null,0,null,null,null,null,0]
[null,null,null,null,null,null,null,{"$f":"'GOEDGEKEURD BUDGET AJU'!$L$40","v":0},0,0,0,null,0,null,null,null,null,0]
[null,null,null,null,null,null,null,{"$f":"'GOEDGEKEURD BUDGET AJU'!$L$40","v":0},0,0,0,null,0,null,null,null,null,0]
[null,null,null,null,null,null,null,{"$f":"'GOEDGEKEURD BUDGET AJU'!$L$40","v":0},0,0,0,null,0,null,null,null,null,0]
[null,null,null,null,null,null,null,{"$f":"'GOEDGEKEURD BUDGET AJU'!$L$40","v":0},0,0,0,null,0,null,null,null,null,0]
[null,null,null,null,null,null,null,{"$f":"'GOEDGEKEURD BUDGET AJU'!$L$40","v":0},0,0,0,null,0,null,null,null,null,0]
[null,null,null,null,null,null,"TOTAAL",null,{"$f":"SUM(I84:I95)","v":0},{"$f":"SUM(J84:J95)","v":0},null,null,{"$f":"SUM(M84:M95)","v":0},{"$f":"SUM(N84:N95)","v":0},null,null,null,{"$f":"SUM(R84:R95)","v":0},{"$f":"SUM(S84:S95)","v":0}]
[null,null,null,{"$f":"CONCATENATE('GOEDGEKEURD BUDGET AJU'!C41,'GOEDGEKEURD BUDGET AJU'!E41)","v":"Kies uit lijst Directe Werkingskosten "},null,null,null,{"$f":"'GOEDGEKEURD BUDGET AJU'!$L$41","v":0},{"$f":"G97*H97","v":0},0,0,null,{"$f":"I97-N97","v":0},null,null,null,null,0]
[null,null,null,null,null,null,null,{"$f":"'GOEDGEKEURD BUDGET AJU'!$L$41","v":0},0,0,0,null,{"$f":"I98-N98","v":0},null,null,null,null,0]
[null,null,null,null,null,null,null,{"$f":"'GOEDGEKEURD BUDGET AJU'!$L$41","v":0},0,0,0,null,0,null,null,null,null,0]
[null,null,null,null,null,null,null,{"$f":"'GOEDGEKEURD BUDGET AJU'!$L$41","v":0},{"$f":"G100*H100","v":0},{"$f":"G100-I100","v":0},{"$f":"IFERROR(+J100/G100,0)","v":0},null,{"$f":"I100-N100","v":0},null,null,null,null,{"$f":"M100-S100","v":0}]
[null,null,null,null,null,null,null,{"$f":"'GOEDGEKEURD BUDGET AJU'!$L$41","v":0},0,0,0,null,0,null,null,null,null,0]
[null,null,null,null,null,null,null,{"$f":"'GOEDGEKEURD BUDGET AJU'!$L$41","v":0},0,0,0,null,0,null,null,null,null,0]
[null,null,null,null,null,null,null,{"$f":"'GOEDGEKEURD BUDGET AJU'!$L$41","v":0},0,0,0,null,0,null,null,null,null,0]
[null,null,null,null,null,null,null,{"$f":"'GOEDGEKEURD BUDGET AJU'!$L$41","v":0},0,0,0,null,0,null,null,null,null,0]
[null,null,null,null,null,null,null,{"$f":"'GOEDGEKEURD BUDGET AJU'!$L$41","v":0},0,0,0,null,0,null,null,null,null,0]
[null,null,null,null,null,null,null,{"$f":"'GOEDGEKEURD BUDGET AJU'!$L$41","v":0},0,0,0,null,0,null,null,null,null,0]
[null,null,null,null,null,null,null,{"$f":"'GOEDGEKEURD BUDGET AJU'!$L$41","v":0},0,0,0,null,0,null,null,null,null,0]
[null,null,null,null,null,null,null,{"$f":"'GOEDGEKEURD BUDGET AJU'!$L$41","v":0},0,0,0,null,0,null,null,null,null,0]
[null,null,null,null,null,null,"TOTAAL",null,{"$f":"SUM(I97:I108)","v":0},{"$f":"SUM(J97:J108)","v":0},null,null,{"$f":"SUM(M97:M108)","v":0},{"$f":"SUM(N97:N108)","v":0},null,null,null,{"$f":"SUM(R97:R108)","v":0},{"$f":"SUM(S97:S108)","v":0}]
[null,null,null,{"$f":"CONCATENATE('GOEDGEKEURD BUDGET AJU'!C42,'GOEDGEKEURD BUDGET AJU'!E42)","v":"Kies uit lijst Directe Werkingskosten "},null,null,null,{"$f":"'GOEDGEKEURD BUDGET AJU'!$L$42","v":0},{"$f":"G110*H110","v":0},0,0,null,{"$f":"I110-N110","v":0},null,null,null,null,0]
[null,null,null,null,null,null,null,{"$f":"'GOEDGEKEURD BUDGET AJU'!$L$42","v":0},0,0,0,null,{"$f":"I111-N111","v":0},null,null,null,null,0]
[null,null,null,null,null,null,null,{"$f":"'GOEDGEKEURD BUDGET AJU'!$L$42","v":0},0,0,0,null,0,null,null,null,null,0]
[null,null,null,null,null,null,null,{"$f":"'GOEDGEKEURD BUDGET AJU'!$L$42","v":0},{"$f":"G113*H113","v":0},{"$f":"G113-I113","v":0},{"$f":"IFERROR(+J113/G113,0)","v":0},null,{"$f":"I113-N113","v":0},null,null,null,null,{"$f":"M113-S113","v":0}]
[null,null,null,null,null,null,null,{"$f":"'GOEDGEKEURD BUDGET AJU'!$L$42","v":0},0,0,0,null,0,null,null,null,null,0]
[null,null,null,null,null,null,null,{"$f":"'GOEDGEKEURD BUDGET AJU'!$L$42","v":0},0,0,0,null,0,null,null,null,null,0]
[null,null,null,null,null,null,null,{"$f":"'GOEDGEKEURD BUDGET AJU'!$L$42","v":0},0,0,0,null,0,null,null,null,null,0]
[null,null,null,null,null,null,null,{"$f":"'GOEDGEKEURD BUDGET AJU'!$L$42","v":0},0,0,0,null,0,null,null,null,null,0]
[null,null,null,null,null,null,null,{"$f":"'GOEDGEKEURD BUDGET AJU'!$L$42","v":0},0,0,0,null,0,null,null,null,null,0]
[null,null,null,null,null,null,null,{"$f":"'GOEDGEKEURD BUDGET AJU'!$L$42","v":0},0,0,0,null,0,null,null,null,null,0]
[null,null,null,null,null,null,null,{"$f":"'GOEDGEKEURD BUDGET AJU'!$L$42","v":0},0,0,0,null,0,null,null,null,null,0]
[null,null,null,null,null,null,null,{"$f":"'GOEDGEKEURD BUDGET AJU'!$L$42","v":0},0,0,0,null,0,null,null,null,null,0]
[null,null,null,null,null,null,"TOTAAL",null,{"$f":"SUM(I110:I121)","v":0},null,null,null,{"$f":"SUM(M110:M121)","v":0},{"$f":"SUM(N110:N121)","v":0},null,null,null,{"$f":"SUM(R110:R121)","v":0},{"$f":"SUM(S110:S121)","v":0}]
[null,null,null,{"$f":"CONCATENATE('GOEDGEKEURD BUDGET AJU'!C43,'GOEDGEKEURD BUDGET AJU'!E43)","v":"Andere: (zelf in te vullen) "},null,null,null,{"$f":"'GOEDGEKEURD BUDGET AJU'!$L$43","v":0},{"$f":"G123*H123","v":0},0,0,null,{"$f":"I123-N123","v":0},null,null,null,null,0]
[null,null,null,null,null,null,null,{"$f":"'GOEDGEKEURD BUDGET AJU'!$L$43","v":0},0,0,0,null,{"$f":"I124-N124","v":0},null,null,null,null,0]
[null,null,null,null,null,null,null,{"$f":"'GOEDGEKEURD BUDGET AJU'!$L$43","v":0},{"$f":"G125*H125","v":0},{"$f":"G125-I125","v":0},{"$f":"IFERROR(+J125/G125,0)","v":0},null,{"$f":"I125-N125","v":0},null,null,null,null,{"$f":"M125-S125","v":0}]
[null,null,null,null,null,null,null,{"$f":"'GOEDGEKEURD BUDGET AJU'!$L$43","v":0},0,0,0,null,0,null,null,null,null,0]
[null,null,null,null,null,null,null,{"$f":"'GOEDGEKEURD BUDGET AJU'!$L$43","v":0},0,0,0,null,0,null,null,null,null,0]
[null,null,null,null,null,null,null,{"$f":"'GOEDGEKEURD BUDGET AJU'!$L$43","v":0},0,0,0,null,0,null,null,null,null,0]
[null,null,null,null,null,null,null,{"$f":"'GOEDGEKEURD BUDGET AJU'!$L$43","v":0},0,0,0,null,0,null,null,null,null,0]
[null,null,null,null,null,null,null,{"$f":"'GOEDGEKEURD BUDGET AJU'!$L$43","v":0},0,0,0,null,0,null,null,null,null,0]
[null,null,null,null,null,null,null,{"$f":"'GOEDGEKEURD BUDGET AJU'!$L$43","v":0},0,0,0,null,0,null,null,null,null,0]
[null,null,null,null,null,null,null,{"$f":"'GOEDGEKEURD BUDGET AJU'!$L$43","v":0},0,0,0,null,0,null,null,null,null,0]
[null,null,null,null,null,null,null,{"$f":"'GOEDGEKEURD BUDGET AJU'!$L$43","v":0},0,0,0,null,0,null,null,null,null,0]
[null,null,null,null,null,null,null,{"$f":"'GOEDGEKEURD BUDGET AJU'!$L$43","v":0},0,0,0,null,0,null,null,null,null,0]
[null,null,null,null,null,null,"TOTAAL",null,{"$f":"SUM(I123:I134)","v":0},null,null,null,{"$f":"SUM(M123:M134)","v":0},{"$f":"SUM(N123:N134)","v":0},null,null,null,{"$f":"SUM(R123:R134)","v":0},{"$f":"SUM(S123:S134)","v":0}]
[null,null,null,{"$f":"CONCATENATE('GOEDGEKEURD BUDGET AJU'!C44,'GOEDGEKEURD BUDGET AJU'!E44)","v":"Andere: (zelf in te vullen) "},null,null,null,{"$f":"'GOEDGEKEURD BUDGET AJU'!$L$44","v":0},{"$f":"G136*H136","v":0},0,0,null,{"$f":"I136-N136","v":0},null,null,null,null,0]
[null,null,null,null,null,null,null,{"$f":"'GOEDGEKEURD BUDGET AJU'!$L$44","v":0},0,0,0,null,{"$f":"I137-N137","v":0},null,null,null,null,0]
[null,null,null,null,null,null,null,{"$f":"'GOEDGEKEURD BUDGET AJU'!$L$44","v":0},0,0,0,null,0,null,null,null,null,0]
[null,null,null,null,null,null,null,{"$f":"'GOEDGEKEURD BUDGET AJU'!$L$44","v":0},{"$f":"G139*H139","v":0},{"$f":"G139-I139","v":0},{"$f":"IFERROR(+J139/G139,0)","v":0},null,{"$f":"I139-N139","v":0},null,null,null,null,{"$f":"M139-S139","v":0}]
[null,null,null,null,null,null,null,{"$f":"'GOEDGEKEURD BUDGET AJU'!$L$44","v":0},0,0,0,null,0,null,null,null,null,0]
[null,null,null,null,null,null,null,{"$f":"'GOEDGEKEURD BUDGET AJU'!$L$44","v":0},0,0,0,null,0,null,null,null,null,0]
[null,null,null,null,null,null,null,{"$f":"'GOEDGEKEURD BUDGET AJU'!$L$44","v":0},0,0,0,null,0,null,null,null,null,0]
[null,null,null,null,null,null,null,{"$f":"'GOEDGEKEURD BUDGET AJU'!$L$44","v":0},0,0,0,null,0,null,null,null,null,0]
[null,null,null,null,null,null,null,{"$f":"'GOEDGEKEURD BUDGET AJU'!$L$44","v":0},0,0,0,null,0,null,null,null,null,0]
[null,null,null,null,null,null,null,{"$f":"'GOEDGEKEURD BUDGET AJU'!$L$44","v":0},0,0,0,null,0,null,null,null,null,0]
[null,null,null,null,null,null,null,{"$f":"'GOEDGEKEURD BUDGET AJU'!$L$44","v":0},0,{"$f":"G146-I146","v":0},{"$f":"IFERROR(+J146/G146,0)","v":0},null,0,null,null,null,null,{"$f":"M146-S146","v":0}]
[null,null,null,null,null,null,null,{"$f":"'GOEDGEKEURD BUDGET AJU'!$L$44","v":0},0,0,0,null,0,null,null,null,null,0]
[null,null,null,null,null,null,"TOTAAL",null,{"$f":"SUM(I136:I147)","v":0},null,null,null,{"$f":"SUM(M136:M147)","v":0},{"$f":"SUM(N136:N147)","v":0},null,null,null,{"$f":"SUM(R136:R147)","v":0},{"$f":"SUM(S136:S147)","v":0}]
["TOTAAL GOEDGEKEURD BUDGET",null,null,{"$f":"'GOEDGEKEURD BUDGET AJU'!K45","v":0},null,null,"TOTAAL WERKELIJKE KOSTEN",null,{"$f":"I18+I31+I44+I57+I70+I83+I96+I109+I135+I148+I122","v":0},{"$f":"J18+J31+J44+J57+J70+J83+J96+J109+J122+J135+J148","v":0},null,null,{"$f":"M18+M44+M57+M70+M96+M109+M135+M148+M31+M122","v":0},{"$f":"N18+N44+N57+N70+N96+N109+N135+N148+N31+N122","v":0},null,null,null,{"$f":"R148+R135+R122+R109+R96+R83+R70+R57+R44+R31+R18","v":0}]
[null,null,null,null,null,null,null,null,null,null,null,null,null,null,null,null,null,{"$f":"M150-S150","v":0}]
[]
[]
["2. Checklist Directe werkingskosten"]
[]
[null,"Zijn de nodige bewijzen betreffende de directe werkingskosten toegewezen aan het project aanwezig?"]
[null,"Zijn de uitgaven gedaan binnen de subsidiabiliteitsperiode?"]
[null,"Is er een duidelijke link tussen de uitgaven toegewezen aan het project en de inhoud van het project"]

{"sheet":"Indirecte werkingskosten","index":15,"n_rows":170,"n_cols":17,"rows_kept":170,"cut":false,"hidden":true,"merged":[[18,3,29,3],[31,3,42,3],[170,1,170,11],[171,1,171,11],[172,1,172,11],[148,3,159,3],[165,0,166,10],[167,1,167,11],[168,1,168,11],[169,1,169,11],[161,0,162,2],[161,3,162,3],[161,6,162,7],[161,5,162,5],[44,3,55,3],[57,3,68,3],[0,13,2,16],[161,16,162,16],[83,3,94,3],[96,3,107,3],[109,3,120,3],[135,3,146,3],[122,3,133,3],[161,13,162,13],[161,14,162,14],[161,15,162,15],[161,8,162,8],[161,10,162,10],[70,3,81,3],[5,3,16,3]]}
["Indirecte werkingkosten",null,null,null,null,"Alle cijfers moeten gemakkelijk terug te vinden zijn in de geleverde bewijsstukken. Indien niet, gelieve meer uitleg te verschaffen bij de opmerkingen",null,null,null,null,null,null,null,"INPUT FEDASIL"]
[]
["1. Detail kosten"]
[]
["Doc. nr.","Datum factuur","Projectcode","Subrubriek","Naam van de leverancier","Een korte omschrijving voor uitgaven < €500 euro en een meer gedetailleerde omschrijving en motivatie voor uitgaven > € 500 euro.","Totaal factuurbedrag","% Fedasil financiering","Bedrag Fedasil-financiering\n","Uitleg en berekening van de verdeelsleutel","Andere financierings-bronnen reële uitgaven","% andere bronnen",null,"Subsidiabel Fedasil","Niet subsidiabel","Opmerkingen FEDASIL na controle","Extra input OPE FEDASIL na controle"]
[null,null,null,{"$f":"'GOEDGEKEURD BUDGET AJU'!C47","v":"Kies uit lijst Indirecte Werkingskosten"},null,null,null,{"$f":"'GOEDGEKEURD BUDGET AJU'!$I$47","v":0},{"$f":"G6*H6","v":0},null,{"$f":"(G6-I6)","v":0},{"$f":"IFERROR(+K6/G6,0)","v":0},null,{"$f":"I6-O6","v":0}]
[null,null,null,null,null,null,null,{"$f":"'GOEDGEKEURD BUDGET AJU'!$I$47","v":0},{"$f":"G7*H7","v":0},null,{"$f":"(G7-I7)","v":0},{"$f":"IFERROR(+K7/G7,0)","v":0},null,{"$f":"I7-O7","v":0}]
[null,null,null,null,null,null,null,{"$f":"'GOEDGEKEURD BUDGET AJU'!$I$47","v":0},0,null,0,0,null,0]
[null,null,null,null,null,null,null,{"$f":"'GOEDGEKEURD BUDGET AJU'!$I$47","v":0},0,null,0,0,null,0]
[null,null,null,null,null,null,null,{"$f":"'GOEDGEKEURD BUDGET AJU'!$I$47","v":0},0,null,0,0,null,0]
[null,null,null,null,null,null,null,{"$f":"'GOEDGEKEURD BUDGET AJU'!$I$47","v":0},0,null,{"$f":"(G11-I11)","v":0},{"$f":"IFERROR(+K11/G11,0)","v":0},null,{"$f":"I11-O11","v":0}]
[null,null,null,null,null,null,null,{"$f":"'GOEDGEKEURD BUDGET AJU'!$I$47","v":0},{"$f":"G12*H12","v":0},null,0,0,null,0]
[null,null,null,null,null,null,null,{"$f":"'GOEDGEKEURD BUDGET AJU'!$I$47","v":0},0,null,0,0,null,0]
[null,null,null,null,null,null,null,{"$f":"'GOEDGEKEURD BUDGET AJU'!$I$47","v":0},0,null,0,0,null,0]
[null,null,null,null,null,null,null,{"$f":"'GOEDGEKEURD BUDGET AJU'!$I$47","v":0},0,null,0,0,null,0]
[null,null,null,null,null,null,null,{"$f":"'GOEDGEKEURD BUDGET AJU'!$I$47","v":0},0,null,0,0,null,0]
[null,null,null,null,null,null,null,{"$f":"'GOEDGEKEURD BUDGET AJU'!$I$47","v":0},0,null,0,0,null,0]
[null,null,null,null,null,null,"TOTAAL",null,{"$f":"SUM(I6:I17)","v":0},null,{"$f":"SUM(K6:K17)","v":0},null,null,{"$f":"SUM(N6:N17)","v":0},{"$f":"SUM(O6:O17)","v":0}]
[null,null,null,{"$f":"'GOEDGEKEURD BUDGET AJU'!C48","v":"Kies uit lijst Indirecte Werkingskosten"},null,null,null,{"$f":"'GOEDGEKEURD BUDGET AJU'!$I$48","v":0},0,null,{"$f":"(G19-I19)","v":0},0,null,{"$f":"I19-O19","v":0}]
[null,null,null,null,null,null,null,{"$f":"'GOEDGEKEURD BUDGET AJU'!$I$48","v":0},0,null,{"$f":"(G20-I20)","v":0},0,null,{"$f":"I20-O20","v":0}]
[null,null,null,null,null,null,null,{"$f":"'GOEDGEKEURD BUDGET AJU'!$I$48","v":0},0,null,0,0,null,0]
[null,null,null,null,null,null,null,{"$f":"'GOEDGEKEURD BUDGET AJU'!$I$48","v":0},0,null,{"$f":"(G22-I22)","v":0},{"$f":"IFERROR(+K22/G22,0)","v":0},null,{"$f":"I22-O22","v":0}]
[null,null,null,null,null,null,null,{"$f":"'GOEDGEKEURD BUDGET AJU'!$I$48","v":0},0,null,0,0,null,0]
[null,null,null,null,null,null,null,{"$f":"'GOEDGEKEURD BUDGET AJU'!$I$48","v":0},{"$f":"G24*H24","v":0},null,0,0,null,0]
[null,null,null,null,null,null,null,{"$f":"'GOEDGEKEURD BUDGET AJU'!$I$48","v":0},0,null,0,0,null,0]
[null,null,null,null,null,null,null,{"$f":"'GOEDGEKEURD BUDGET AJU'!$I$48","v":0},0,null,0,0,null,0]
[null,null,null,null,null,null,null,{"$f":"'GOEDGEKEURD BUDGET AJU'!$I$48","v":0},0,null,0,0,null,0]
[null,null,null,null,null,null,null,{"$f":"'GOEDGEKEURD BUDGET AJU'!$I$48","v":0},0,null,0,0,null,0]
[null,null,null,null,null,null,null,{"$f":"'GOEDGEKEURD BUDGET AJU'!$I$48","v":0},0,null,0,0,null,0]
[null,null,null,null,null,null,null,{"$f":"'GOEDGEKEURD BUDGET AJU'!$I$48","v":0},0,null,0,0,null,0]
[null,null,null,null,null,null,"TOTAAL",null,{"$f":"SUM(I19:I30)","v":0},null,{"$f":"SUM(K19:K30)","v":0},null,null,{"$f":"SUM(N19:N30)","v":0},{"$f":"SUM(O19:O30)","v":0}]
[null,null,null,{"$f":"'GOEDGEKEURD BUDGET AJU'!C49","v":"Kies uit lijst Indirecte Werkingskosten"},null,null,null,{"$f":"'GOEDGEKEURD BUDGET AJU'!$I$49","v":0},{"$f":"G32*H32","v":0},null,{"$f":"(G32-I32)","v":0},0,null,{"$f":"I32-O32","v":0}]
[null,null,null,null,null,null,null,{"$f":"'GOEDGEKEURD BUDGET AJU'!$I$49","v":0},0,null,{"$f":"(G33-I33)","v":0},0,null,{"$f":"I33-O33","v":0}]
[null,null,null,null,null,null,null,{"$f":"'GOEDGEKEURD BUDGET AJU'!$I$49","v":0},0,null,0,0,null,0]
[null,null,null,null,null,null,null,{"$f":"'GOEDGEKEURD BUDGET AJU'!$I$49","v":0},0,null,{"$f":"(G35-I35)","v":0},{"$f":"IFERROR(+K35/G35,0)","v":0},null,{"$f":"I35-O35","v":0}]
[null,null,null,null,null,null,null,{"$f":"'GOEDGEKEURD BUDGET AJU'!$I$49","v":0},0,null,0,0,null,0]
[null,null,null,null,null,null,null,{"$f":"'GOEDGEKEURD BUDGET AJU'!$I$49","v":0},{"$f":"G37*H37","v":0},null,0,0,null,0]
[null,null,null,null,null,null,null,{"$f":"'GOEDGEKEURD BUDGET AJU'!$I$49","v":0},0,null,0,0,null,0]
[null,null,null,null,null,null,null,{"$f":"'GOEDGEKEURD BUDGET AJU'!$I$49","v":0},0,null,0,0,null,0]
[null,null,null,null,null,null,null,{"$f":"'GOEDGEKEURD BUDGET AJU'!$I$49","v":0},0,null,0,0,null,0]
[null,null,null,null,null,null,null,{"$f":"'GOEDGEKEURD BUDGET AJU'!$I$49","v":0},0,null,0,0,null,0]
[null,null,null,null,null,null,null,{"$f":"'GOEDGEKEURD BUDGET AJU'!$I$49","v":0},0,null,0,0,null,0]
[null,null,null,null,null,null,null,{"$f":"'GOEDGEKEURD BUDGET AJU'!$I$49","v":0},0,null,0,0,null,0]
[null,null,null,null,null,null,"TOTAAL",null,{"$f":"SUM(I32:I43)","v":0},null,{"$f":"SUM(K32:K43)","v":0},null,null,{"$f":"SUM(N32:N43)","v":0},{"$f":"SUM(O32:O43)","v":0}]
[null,null,null,{"$f":"'GOEDGEKEURD BUDGET AJU'!C50","v":"Kies uit lijst Indirecte Werkingskosten"},null,null,null,{"$f":"'GOEDGEKEURD BUDGET AJU'!$I$50","v":0},{"$f":"G45*H45","v":0},null,{"$f":"(G45-I45)","v":0},0,null,{"$f":"I45-O45","v":0}]
[null,null,null,null,null,null,null,{"$f":"'GOEDGEKEURD BUDGET AJU'!$I$50","v":0},0,null,{"$f":"(G46-I46)","v":0},0,null,{"$f":"I46-O46","v":0}]
[null,null,null,null,null,null,null,{"$f":"'GOEDGEKEURD BUDGET AJU'!$I$50","v":0},0,null,0,0,null,0]
[null,null,null,null,null,null,null,{"$f":"'GOEDGEKEURD BUDGET AJU'!$I$50","v":0},0,null,{"$f":"(G48-I48)","v":0},{"$f":"IFERROR(+K48/G48,0)","v":0},null,{"$f":"I48-O48","v":0}]
[null,null,null,null,null,null,null,{"$f":"'GOEDGEKEURD BUDGET AJU'!$I$50","v":0},0,null,0,0,null,0]
[null,null,null,null,null,null,null,{"$f":"'GOEDGEKEURD BUDGET AJU'!$I$50","v":0},0,null,0,0,null,0]
[null,null,null,null,null,null,null,{"$f":"'GOEDGEKEURD BUDGET AJU'!$I$50","v":0},0,null,0,0,null,0]
[null,null,null,null,null,null,null,{"$f":"'GOEDGEKEURD BUDGET AJU'!$I$50","v":0},{"$f":"G52*H52","v":0},null,0,0,null,0]
[null,null,null,null,null,null,null,{"$f":"'GOEDGEKEURD BUDGET AJU'!$I$50","v":0},0,null,0,0,null,0]
[null,null,null,null,null,null,null,{"$f":"'GOEDGEKEURD BUDGET AJU'!$I$50","v":0},0,null,0,0,null,0]
[null,null,null,null,null,null,null,{"$f":"'GOEDGEKEURD BUDGET AJU'!$I$50","v":0},0,null,0,0,null,0]
[null,null,null,null,null,null,null,{"$f":"'GOEDGEKEURD BUDGET AJU'!$I$50","v":0},0,null,0,0,null,0]
[null,null,null,null,null,null,"TOTAAL",null,{"$f":"SUM(I45:I56)","v":0},null,{"$f":"SUM(K45:K56)","v":0},null,null,{"$f":"SUM(N45:N56)","v":0},{"$f":"SUM(O45:O56)","v":0}]
[null,null,null,{"$f":"'GOEDGEKEURD BUDGET AJU'!C51","v":"Kies uit lijst Indirecte Werkingskosten"},null,null,null,{"$f":"'GOEDGEKEURD BUDGET AJU'!$I$51","v":0},{"$f":"G58*H58","v":0},null,{"$f":"(G58-I58)","v":0},0,null,{"$f":"I58-O58","v":0}]
[null,null,null,null,null,null,null,{"$f":"'GOEDGEKEURD BUDGET AJU'!$I$51","v":0},0,null,{"$f":"(G59-I59)","v":0},0,null,{"$f":"I59-O59","v":0}]
[null,null,null,null,null,null,null,{"$f":"'GOEDGEKEURD BUDGET AJU'!$I$51","v":0},0,null,0,0,null,0]
[null,null,null,null,null,null,null,{"$f":"'GOEDGEKEURD BUDGET AJU'!$I$51","v":0},0,null,0,0,null,0]
[null,null,null,null,null,null,null,{"$f":"'GOEDGEKEURD BUDGET AJU'!$I$51","v":0},0,null,{"$f":"(G62-I62)","v":0},{"$f":"IFERROR(+K62/G62,0)","v":0},null,{"$f":"I62-O62","v":0}]
[null,null,null,null,null,null,null,{"$f":"'GOEDGEKEURD BUDGET AJU'!$I$51","v":0},0,null,0,0,null,0]
[null,null,null,null,null,null,null,{"$f":"'GOEDGEKEURD BUDGET AJU'!$I$51","v":0},{"$f":"G64*H64","v":0},null,0,0,null,0]
[null,null,null,null,null,null,null,{"$f":"'GOEDGEKEURD BUDGET AJU'!$I$51","v":0},0,null,0,0,null,0]
[null,null,null,null,null,null,null,{"$f":"'GOEDGEKEURD BUDGET AJU'!$I$51","v":0},0,null,0,0,null,0]
[null,null,null,null,null,null,null,{"$f":"'GOEDGEKEURD BUDGET AJU'!$I$51","v":0},0,null,0,0,null,0]
[null,null,null,null,null,null,null,{"$f":"'GOEDGEKEURD BUDGET AJU'!$I$51","v":0},0,null,0,0,null,0]
[null,null,null,null,null,null,null,{"$f":"'GOEDGEKEURD BUDGET AJU'!$I$51","v":0},0,null,0,0,null,0]
[null,null,null,null,null,null,"TOTAAL",null,{"$f":"SUM(I58:I69)","v":0},null,{"$f":"SUM(K58:K69)","v":0},null,null,{"$f":"SUM(N58:N69)","v":0},{"$f":"SUM(O58:O69)","v":0}]
[null,null,null,{"$f":"'GOEDGEKEURD BUDGET AJU'!C52","v":"Kies uit lijst Indirecte Werkingskosten"},null,null,null,{"$f":"'GOEDGEKEURD BUDGET AJU'!$I$52","v":0},{"$f":"G71*H71","v":0},null,{"$f":"(G71-I71)","v":0},0,null,{"$f":"I71-O71","v":0}]
[null,null,null,null,null,null,null,{"$f":"'GOEDGEKEURD BUDGET AJU'!$I$52","v":0},0,null,{"$f":"(G72-I72)","v":0},0,null,{"$f":"I72-O72","v":0}]
[null,null,null,null,null,null,null,{"$f":"'GOEDGEKEURD BUDGET AJU'!$I$52","v":0},0,null,0,0,null,0]
[null,null,null,null,null,null,null,{"$f":"'GOEDGEKEURD BUDGET AJU'!$I$52","v":0},0,null,0,0,null,0]
[null,null,null,null,null,null,null,{"$f":"'GOEDGEKEURD BUDGET AJU'!$I$52","v":0},0,null,0,0,null,0]
[null,null,null,null,null,null,null,{"$f":"'GOEDGEKEURD BUDGET AJU'!$I$52","v":0},0,null,{"$f":"(G76-I76)","v":0},{"$f":"IFERROR(+K76/G76,0)","v":0},null,{"$f":"I76-O76","v":0}]
[null,null,null,null,null,null,null,{"$f":"'GOEDGEKEURD BUDGET AJU'!$I$52","v":0},0,null,0,0,null,0]
[null,null,null,null,null,null,null,{"$f":"'GOEDGEKEURD BUDGET AJU'!$I$52","v":0},{"$f":"G78*H78","v":0},null,0,0,null,0]
[null,null,null,null,null,null,null,{"$f":"'GOEDGEKEURD BUDGET AJU'!$I$52","v":0},0,null,0,0,null,0]
[null,null,null,null,null,null,null,{"$f":"'GOEDGEKEURD BUDGET AJU'!$I$52","v":0},0,null,0,0,null,0]
[null,null,null,null,null,null,null,{"$f":"'GOEDGEKEURD BUDGET AJU'!$I$52","v":0},0,null,0,{"$f":"IFERROR(+K81/G81,0)","v":0},null,0]
[null,null,null,null,null,null,null,{"$f":"'GOEDGEKEURD BUDGET AJU'!$I$52","v":0},0,null,0,0,null,0]
[null,null,null,null,null,null,"TOTAAL",null,{"$f":"SUM(I71:I82)","v":0},null,{"$f":"SUM(K71:K82)","v":0},null,null,{"$f":"SUM(N71:N82)","v":0},{"$f":"SUM(O71:O82)","v":0}]
[null,null,null,{"$f":"'GOEDGEKEURD BUDGET AJU'!C53","v":"Kies uit lijst Indirecte Werkingskosten"},null,null,null,{"$f":"'GOEDGEKEURD BUDGET AJU'!$I$53","v":0},{"$f":"G84*H84","v":0},null,{"$f":"(G84-I84)","v":0},0,null,{"$f":"I84-O84","v":0}]
[null,null,null,null,null,null,null,{"$f":"'GOEDGEKEURD BUDGET AJU'!$I$53","v":0},0,null,{"$f":"(G85-I85)","v":0},0,null,{"$f":"I85-O85","v":0}]
[null,null,null,null,null,null,null,{"$f":"'GOEDGEKEURD BUDGET AJU'!$I$53","v":0},0,null,0,0,null,0]
[null,null,null,null,null,null,null,{"$f":"'GOEDGEKEURD BUDGET AJU'!$I$53","v":0},0,null,{"$f":"(G87-I87)","v":0},{"$f":"IFERROR(+K87/G87,0)","v":0},null,{"$f":"I87-O87","v":0}]
[null,null,null,null,null,null,null,{"$f":"'GOEDGEKEURD BUDGET AJU'!$I$53","v":0},0,null,0,0,null,0]
[null,null,null,null,null,null,null,{"$f":"'GOEDGEKEURD BUDGET AJU'!$I$53","v":0},{"$f":"G89*H89","v":0},null,0,0,null,0]
[null,null,null,null,null,null,null,{"$f":"'GOEDGEKEURD BUDGET AJU'!$I$53","v":0},0,null,0,0,null,0]
[null,null,null,null,null,null,null,{"$f":"'GOEDGEKEURD BUDGET AJU'!$I$53","v":0},0,null,0,0,null,0]
[null,null,null,null,null,null,null,{"$f":"'GOEDGEKEURD BUDGET AJU'!$I$53","v":0},0,null,0,0,null,0]
[null,null,null,null,null,null,null,{"$f":"'GOEDGEKEURD BUDGET AJU'!$I$53","v":0},0,null,0,0,null,0]
[null,null,null,null,null,null,null,{"$f":"'GOEDGEKEURD BUDGET AJU'!$I$53","v":0},0,null,0,0,null,0]
[null,null,null,null,null,null,null,{"$f":"'GOEDGEKEURD BUDGET AJU'!$I$53","v":0},0,null,0,0,null,0]
[null,null,null,null,null,null,"TOTAAL",null,{"$f":"SUM(I84:I95)","v":0},null,{"$f":"SUM(K84:K95)","v":0},null,null,{"$f":"SUM(N84:N95)","v":0},{"$f":"SUM(O84:O95)","v":0}]
[null,null,null,{"$f":"'GOEDGEKEURD BUDGET AJU'!C54","v":"Kies uit lijst Indirecte Werkingskosten"},null,null,null,{"$f":"'GOEDGEKEURD BUDGET AJU'!$I$54","v":0},{"$f":"G97*H97","v":0},null,{"$f":"(G97-I97)","v":0},0,null,{"$f":"I97-O97","v":0}]
[null,null,null,null,null,null,null,{"$f":"'GOEDGEKEURD BUDGET AJU'!$I$54","v":0},0,null,{"$f":"(G98-I98)","v":0},0,null,{"$f":"I98-O98","v":0}]
[null,null,null,null,null,null,null,{"$f":"'GOEDGEKEURD BUDGET AJU'!$I$54","v":0},0,null,0,0,null,0]
[null,null,null,null,null,null,null,{"$f":"'GOEDGEKEURD BUDGET AJU'!$I$54","v":0},0,null,0,0,null,0]
[null,null,null,null,null,null,null,{"$f":"'GOEDGEKEURD BUDGET AJU'!$I$54","v":0},0,null,0,0,null,0]
[null,null,null,null,null,null,null,{"$f":"'GOEDGEKEURD BUDGET AJU'!$I$54","v":0},{"$f":"G102*H102","v":0},null,{"$f":"(G102-I102)","v":0},{"$f":"IFERROR(+K102/G102,0)","v":0},null,{"$f":"I102-O102","v":0}]
[null,null,null,null,null,null,null,{"$f":"'GOEDGEKEURD BUDGET AJU'!$I$54","v":0},0,null,0,0,null,0]
[null,null,null,null,null,null,null,{"$f":"'GOEDGEKEURD BUDGET AJU'!$I$54","v":0},0,null,0,0,null,0]
[null,null,null,null,null,null,null,{"$f":"'GOEDGEKEURD BUDGET AJU'!$I$54","v":0},0,null,0,0,null,0]
[null,null,null,null,null,null,null,{"$f":"'GOEDGEKEURD BUDGET AJU'!$I$54","v":0},0,null,0,0,null,0]
[null,null,null,null,null,null,null,{"$f":"'GOEDGEKEURD BUDGET AJU'!$I$54","v":0},0,null,0,0,null,0]
[null,null,null,null,null,null,null,{"$f":"'GOEDGEKEURD BUDGET AJU'!$I$54","v":0},0,null,0,0,null,0]
[null,null,null,null,null,null,"TOTAAL",null,{"$f":"SUM(I97:I108)","v":0},null,{"$f":"SUM(K97:K108)","v":0},null,null,{"$f":"SUM(N97:N108)","v":0},{"$f":"SUM(O97:O108)","v":0}]
[null,null,null,{"$f":"'GOEDGEKEURD BUDGET AJU'!C55","v":"Kies uit lijst Indirecte Werkingskosten"},null,null,null,{"$f":"'GOEDGEKEURD BUDGET AJU'!$I$55","v":0},{"$f":"G110*H110","v":0},null,{"$f":"(G110-I110)","v":0},0,null,{"$f":"I110-O110","v":0}]
[null,null,null,null,null,null,null,{"$f":"'GOEDGEKEURD BUDGET AJU'!$I$55","v":0},0,null,{"$f":"(G111-I111)","v":0},0,null,{"$f":"I111-O111","v":0}]
[null,null,null,null,null,null,null,{"$f":"'GOEDGEKEURD BUDGET AJU'!$I$55","v":0},0,null,0,0,null,0]
[null,null,null,null,null,null,null,{"$f":"'GOEDGEKEURD BUDGET AJU'!$I$55","v":0},0,null,{"$f":"(G113-I113)","v":0},{"$f":"IFERROR(+K113/G113,0)","v":0},null,{"$f":"I113-O113","v":0}]
[null,null,null,null,null,null,null,{"$f":"'GOEDGEKEURD BUDGET AJU'!$I$55","v":0},0,null,0,0,null,0]
[null,null,null,null,null,null,null,{"$f":"'GOEDGEKEURD BUDGET AJU'!$I$55","v":0},{"$f":"G115*H115","v":0},null,0,0,null,0]
[null,null,null,null,null,null,null,{"$f":"'GOEDGEKEURD BUDGET AJU'!$I$55","v":0},0,null,0,0,null,0]
[null,null,null,null,null,null,null,{"$f":"'GOEDGEKEURD BUDGET AJU'!$I$55","v":0},0,null,0,0,null,0]
[null,null,null,null,null,null,null,{"$f":"'GOEDGEKEURD BUDGET AJU'!$I$55","v":0},0,null,0,0,null,0]
[null,null,null,null,null,null,null,{"$f":"'GOEDGEKEURD BUDGET AJU'!$I$55","v":0},0,null,0,0,null,0]
[null,null,null,null,null,null,null,{"$f":"'GOEDGEKEURD BUDGET AJU'!$I$55","v":0},0,null,0,0,null,0]
[null,null,null,null,null,null,null,{"$f":"'GOEDGEKEURD BUDGET AJU'!$I$55","v":0},0,null,0,0,null,0]
[null,null,null,null,null,null,"TOTAAL",null,{"$f":"SUM(I110:I121)","v":0},null,null,null,null,{"$f":"SUM(N110:N121)","v":0},{"$f":"SUM(O110:O121)","v":0}]
[null,null,null,{"$f":"'GOEDGEKEURD BUDGET AJU'!C56","v":"Kies uit lijst Indirecte Werkingskosten"},null,null,null,{"$f":"'GOEDGEKEURD BUDGET AJU'!$I$56","v":0},{"$f":"G123*H123","v":0},null,{"$f":"(G123-I123)","v":0},{"$f":"IFERROR(+K123/G123,0)","v":0},null,{"$f":"I123-O123","v":0}]
[null,null,null,null,null,null,null,{"$f":"'GOEDGEKEURD BUDGET AJU'!$I$56","v":0},0,null,{"$f":"(G124-I124)","v":0},0,null,{"$f":"I124-O124","v":0}]
[null,null,null,null,null,null,null,{"$f":"'GOEDGEKEURD BUDGET AJU'!$I$56","v":0},0,null,0,0,null,0]
[null,null,null,null,null,null,null,{"$f":"'GOEDGEKEURD BUDGET AJU'!$I$56","v":0},0,null,{"$f":"(G126-I126)","v":0},{"$f":"IFERROR(+K126/G126,0)","v":0},null,{"$f":"I126-O126","v":0}]
[null,null,null,null,null,null,null,{"$f":"'GOEDGEKEURD BUDGET AJU'!$I$56","v":0},0,null,0,0,null,0]
[null,null,null,null,null,null,null,{"$f":"'GOEDGEKEURD BUDGET AJU'!$I$56","v":0},0,null,0,0,null,0]
[null,null,null,null,null,null,null,{"$f":"'GOEDGEKEURD BUDGET AJU'!$I$56","v":0},0,null,0,0,null,{"$f":"I129-O129","v":0}]
[null,null,null,null,null,null,null,{"$f":"'GOEDGEKEURD BUDGET AJU'!$I$56","v":0},0,null,0,0,null,0]
[null,null,null,null,null,null,null,{"$f":"'GOEDGEKEURD BUDGET AJU'!$I$56","v":0},0,null,0,0,null,0]
[null,null,null,null,null,null,null,{"$f":"'GOEDGEKEURD BUDGET AJU'!$I$56","v":0},0,null,0,0,null,0]
[null,null,null,null,null,null,null,{"$f":"'GOEDGEKEURD BUDGET AJU'!$I$56","v":0},0,null,0,0,null,0]
[null,null,null,null,null,null,null,{"$f":"'GOEDGEKEURD BUDGET AJU'!$I$56","v":0},0,null,0,0,null,0]
[null,null,null,null,null,null,"TOTAAL",null,{"$f":"SUM(I123:I134)","v":0},null,null,null,null,{"$f":"SUM(N123:N134)","v":0},{"$f":"SUM(O123:O134)","v":0}]
[null,null,null,{"$f":"'GOEDGEKEURD BUDGET AJU'!C57","v":"Andere: (zelf in te vullen)"},null,null,null,{"$f":"'GOEDGEKEURD BUDGET AJU'!$I$57","v":0},{"$f":"G136*H136","v":0},null,{"$f":"(G136-I136)","v":0},0,null,{"$f":"I136-O136","v":0}]
[null,null,null,null,null,null,null,{"$f":"'GOEDGEKEURD BUDGET AJU'!$I$57","v":0},0,null,{"$f":"(G137-I137)","v":0},0,null,{"$f":"I137-O137","v":0}]
[null,null,null,null,null,null,null,{"$f":"'GOEDGEKEURD BUDGET AJU'!$I$57","v":0},0,null,0,0,null,0]
[null,null,null,null,null,null,null,{"$f":"'GOEDGEKEURD BUDGET AJU'!$I$57","v":0},0,null,0,0,null,0]
[null,null,null,null,null,null,null,{"$f":"'GOEDGEKEURD BUDGET AJU'!$I$57","v":0},0,null,{"$f":"(G140-I140)","v":0},{"$f":"IFERROR(+K140/G140,0)","v":0},null,{"$f":"I140-O140","v":0}]
[null,null,null,null,null,null,null,{"$f":"'GOEDGEKEURD BUDGET AJU'!$I$57","v":0},{"$f":"G141*H141","v":0},null,0,0,null,0]
[null,null,null,null,null,null,null,{"$f":"'GOEDGEKEURD BUDGET AJU'!$I$57","v":0},0,null,0,0,null,0]
[null,null,null,null,null,null,null,{"$f":"'GOEDGEKEURD BUDGET AJU'!$I$57","v":0},0,null,0,0,null,0]
[null,null,null,null,null,null,null,{"$f":"'GOEDGEKEURD BUDGET AJU'!$I$57","v":0},0,null,0,0,null,0]
[null,null,null,null,null,null,null,{"$f":"'GOEDGEKEURD BUDGET AJU'!$I$57","v":0},0,null,0,0,null,0]
[null,null,null,null,null,null,null,{"$f":"'GOEDGEKEURD BUDGET AJU'!$I$57","v":0},0,null,0,0,null,0]
[null,null,null,null,null,null,null,{"$f":"'GOEDGEKEURD BUDGET AJU'!$I$57","v":0},0,null,0,0,null,0]
[null,null,null,null,null,null,"TOTAAL",null,{"$f":"SUM(I136:I147)","v":0},null,null,null,null,{"$f":"SUM(N136:N147)","v":0},{"$f":"SUM(O136:O147)","v":0}]
[null,null,null,{"$f":"'GOEDGEKEURD BUDGET AJU'!C58","v":"Andere: (zelf in te vullen)"},null,null,null,{"$f":"'GOEDGEKEURD BUDGET AJU'!$I$58","v":0},{"$f":"G149*H149","v":0},null,{"$f":"(G149-I149)","v":0},{"$f":"IFERROR(+K149/G149,0)","v":0},null,{"$f":"I149-O149","v":0}]
[null,null,null,null,null,null,null,{"$f":"'GOEDGEKEURD BUDGET AJU'!$I$58","v":0},0,null,{"$f":"(G150-I150)","v":0},0,null,{"$f":"I150-O150","v":0}]
[null,null,null,null,null,null,null,{"$f":"'GOEDGEKEURD BUDGET AJU'!$I$58","v":0},0,null,0,0,null,0]
[null,null,null,null,null,null,null,{"$f":"'GOEDGEKEURD BUDGET AJU'!$I$58","v":0},0,null,0,0,null,0]
[null,null,null,null,null,null,null,{"$f":"'GOEDGEKEURD BUDGET AJU'!$I$58","v":0},0,null,{"$f":"(G153-I153)","v":0},{"$f":"IFERROR(+K153/G153,0)","v":0},null,{"$f":"I153-O153","v":0}]
[null,null,null,null,null,null,null,{"$f":"'GOEDGEKEURD BUDGET AJU'!$I$58","v":0},{"$f":"G154*H154","v":0},null,0,0,null,0]
[null,null,null,null,null,null,null,{"$f":"'GOEDGEKEURD BUDGET AJU'!$I$58","v":0},0,null,0,0,null,0]
[null,null,null,null,null,null,null,{"$f":"'GOEDGEKEURD BUDGET AJU'!$I$58","v":0},0,null,0,0,null,0]
[null,null,null,null,null,null,null,{"$f":"'GOEDGEKEURD BUDGET AJU'!$I$58","v":0},0,null,0,0,null,0]
[null,null,null,null,null,null,null,{"$f":"'GOEDGEKEURD BUDGET AJU'!$I$58","v":0},0,null,0,0,null,0]
[null,null,null,null,null,null,null,{"$f":"'GOEDGEKEURD BUDGET AJU'!$I$58","v":0},0,null,0,0,null,0]
[null,null,null,null,null,null,null,{"$f":"'GOEDGEKEURD BUDGET AJU'!$I$58","v":0},0,null,0,{"$f":"IFERROR(+K160/G160,0)","v":0},null,0]
[null,null,null,null,null,null,"TOTAAL",null,{"$f":"SUM(I149:I160)","v":0},null,null,null,null,{"$f":"SUM(N149:N160)","v":0},{"$f":"SUM(O149:O160)","v":0}]
["TOTAAL GOEDGEKEURD BUDGET",null,null,{"$f":"'GOEDGEKEURD BUDGET AJU'!K59","v":0},null,null,"TOTAAL WERKELIJKE KOSTEN",null,{"$f":"I18+I31+I44+I57+I70+I83+I96+I109+I122+I161","v":0},null,{"$f":"SUM(K6:K161)","v":0},null,null,{"$f":"N18+N44+N57+N70+N96+N109+N148+N161+N31+N122","v":0},{"$f":"O18+O44+O57+O70+O96+O109+O148+O161+O31+O122","v":0}]
[null,null,null,{"$f":"'GOEDGEKEURD BUDGET AJU'!K59","v":0}]
[]
[]
["2. Checklist Indirecte werkingskosten"]
[]
[null,"Zijn de nodige bewijzen betreffende de indirecte werkingskosten toegewezen aan het project aanwezig?"]
[null,"Zijn de uitgaven gedaan binnen de subsidiabiliteitsperiode?"]
[null,"Is de verdeelsleutel goed toegepast en duidelijk uitgelegd? "]

{"sheet":"Bijkomende vragen Fin Verslag","index":16,"n_rows":558,"n_cols":5,"rows_kept":558,"cut":false,"hidden":true,"merged":[[553,0,553,8],[554,0,554,8],[10,0,10,8],[11,0,11,8],[12,0,12,8],[13,0,13,8],[14,0,14,8],[15,0,15,8],[16,0,16,8],[17,0,17,8],[23,0,23,8],[40,0,40,8],[57,0,57,8],[548,0,548,8],[549,0,549,8],[550,0,550,8],[551,0,551,8],[552,0,552,8],[543,0,543,8],[544,0,544,8],[545,0,545,8],[546,0,546,8],[547,0,547,8],[535,0,535,8],[536,0,536,8],[537,0,537,8],[541,0,541,8],[542,0,542,8],[530,0,530,8],[531,0,531,8],[532,0,532,8],[533,0,533,8],[534,0,534,8],[525,0,525,8],[526,0,526,8],[527,0,527,8],[528,0,528,8],[529,0,529,8],[517,0,517,8],[518,0,518,8],[519,0,519,8],[520,0,520,8],[521,0,521,8],[512,0,512,8],[513,0,513,8],[514,0,514,8],[515,0,515,8],[516,0,516,8],[504,0,504,8],[505,0,505,8],[509,0,509,8],[510,0,510,8],[511,0,511,8],[499,0,499,8],[500,0,500,8],[501,0,501,8],[502,0,502,8],[503,0,503,8],[494,0,494,8],[495,0,495,8],[496,0,496,8],[497,0,497,8],[498,0,498,8],[486,0,486,8],[487,0,487,8],[488,0,488,8],[489,0,489,8],[493,0,493,8],[481,0,481,8],[482,0,482,8],[483,0,483,8],[484,0,484,8],[485,0,485,8],[473,0,473,8],[477,0,477,8],[478,0,478,8],[479,0,479,8],[480,0,480,8],[468,0,468,8],[469,0,469,8],[470,0,470,8],[471,0,471,8],[472,0,472,8],[462,0,462,8],[463,0,463,8],[464,0,464,8],[465,0,465,8],[467,0,467,8],[454,0,454,8],[455,0,455,8],[456,0,456,8],[460,0,460,8],[461,0,461,8],[449,0,449,8],[450,0,450,8],[451,0,451,8],[452,0,452,8],[453,0,453,8],[444,0,444,8],[445,0,445,8],[446,0,446,8],[447,0,447,8],[448,0,448,8],[436,0,436,8],[437,0,437,8],[438,0,438,8],[439,0,439,8],[440,0,440,8],[431,0,431,8],[432,0,432,8],[433,0,433,8],[434,0,434,8],[435,0,435,8],[423,0,423,8],[424,0,424,8],[428,0,428,8],[429,0,429,8],[430,0,430,8],[418,0,418,8],[419,0,419,8],[420,0,420,8],[421,0,421,8],[422,0,422,8],[413,0,413,8],[414,0,414,8],[415,0,415,8],[416,0,416,8],[417,0,417,8],[405,0,405,8],[406,0,406,8],[407,0,407,8],[408,0,408,8],[412,0,412,8],[400,0,400,8],[401,0,401,8],[402,0,402,8],[403,0,403,8],[404,0,404,8],[392,0,392,8],[396,0,396,8],[397,0,397,8],[398,0,398,8],[399,0,399,8],[387,0,387,8],[388,0,388,8],[389,0,389,8],[390,0,390,8],[391,0,391,8],[382,0,382,8],[383,0,383,8],[384,0,384,8],[385,0,385,8],[386,0,386,8],[374,0,374,8],[375,0,375,8],[376,0,376,8],[380,0,380,8],[381,0,381,8],[369,0,369,8],[370,0,370,8],[371,0,371,8],[372,0,372,8],[373,0,373,8],[364,0,364,8],[365,0,365,8],[366,0,366,8],[367,0,367,8],[368,0,368,8],[354,0,354,8],[355,0,355,8],[356,0,356,8],[357,0,357,8],[358,0,358,8],[349,0,349,8],[350,0,350,8],[351,0,351,8],[352,0,352,8],[353,0,353,8],[341,0,341,8],[345,0,345,8],[346,0,346,8],[347,0,347,8],[348,0,348,8],[336,0,336,8],[337,0,337,8],[338,0,338,8],[339,0,339,8],[340,0,340,8],[331,0,331,8],[332,0,332,8],[333,0,333,8],[334,0,334,8],[335,0,335,8],[323,0,323,8],[324,0,324,8],[325,0,325,8],[329,0,329,8],[330,0,330,8],[318,0,318,8],[319,0,319,8],[320,0,320,8],[321,0,321,8],[322,0,322,8],[313,0,313,8],[314,0,314,8],[315,0,315,8],[316,0,316,8],[317,0,317,8],[305,0,305,8],[306,0,306,8],[307,0,307,8],[308,0,308,8],[309,0,309,8],[300,0,300,8],[301,0,301,8],[302,0,302,8],[303,0,303,8],[304,0,304,8],[292,0,292,8],[293,0,293,8],[297,0,297,8],[298,0,298,8],[299,0,299,8],[287,0,287,8],[288,0,288,8],[289,0,289,8],[290,0,290,8],[291,0,291,8],[282,0,282,8],[283,0,283,8],[284,0,284,8],[285,0,285,8],[286,0,286,8],[274,0,274,8],[275,0,275,8],[276,0,276,8],[277,0,277,8],[281,0,281,8],[269,0,269,8],[270,0,270,8],[271,0,271,8],[272,0,272,8],[273,0,273,8],[261,0,261,8],[265,0,265,8],[266,0,266,8],[267,0,267,8],[268,0,268,8],[256,0,256,8],[257,0,257,8],[258,0,258,8],[259,0,259,8],[260,0,260,8],[251,0,251,8],[252,0,252,8],[253,0,253,8],[254,0,254,8],[255,0,255,8],[243,0,243,8],[244,0,244,8],[245,0,245,8],[249,0,249,8],[250,0,250,8],[238,0,238,8],[239,0,239,8],[240,0,240,8],[241,0,241,8],[242,0,242,8],[233,0,233,8],[234,0,234,8],[235,0,235,8],[236,0,236,8],[237,0,237,8],[225,0,225,8],[226,0,226,8],[227,0,227,8],[228,0,228,8],[229,0,229,8],[220,0,220,8],[221,0,221,8],[222,0,222,8],[223,0,223,8],[224,0,224,8],[212,0,212,8],[213,0,213,8],[217,0,217,8],[218,0,218,8],[219,0,219,8],[207,0,207,8],[208,0,208,8],[209,0,209,8],[210,0,210,8],[211,0,211,8],[202,0,202,8],[203,0,203,8],[204,0,204,8],[205,0,205,8],[206,0,206,8],[196,0,196,8],[201,0,201,8],[197,0,197,8],[179,0,179,8],[191,0,191,8],[192,0,192,8],[193,0,193,8],[194,0,194,8],[195,0,195,8],[186,0,186,8],[187,0,187,8],[188,0,188,8],[189,0,189,8],[190,0,190,8],[175,0,175,8],[176,0,176,8],[177,0,177,8],[178,0,178,8],[185,0,185,8],[152,0,152,8],[153,0,153,8],[154,0,154,8],[160,0,160,8],[161,0,161,8],[155,0,155,8],[162,0,162,8],[163,0,163,8],[164,0,164,8],[165,0,165,8],[166,0,166,8],[167,0,167,8],[168,0,168,8],[169,0,169,8],[170,0,170,8],[171,0,171,8],[24,0,24,8],[25,0,25,8],[28,0,28,8],[29,0,29,8],[30,0,30,8],[31,0,31,8],[32,0,32,8],[33,0,33,8],[34,0,34,8],[35,0,35,8],[36,0,36,8],[37,0,37,8],[38,0,38,8],[39,0,39,8],[142,0,142,8],[143,0,143,8],[144,0,144,8],[145,0,145,8],[125,0,125,8],[121,0,121,8],[122,0,122,8],[123,0,123,8],[124,0,124,8],[126,0,126,8],[127,0,127,8],[128,0,128,8],[129,0,129,8],[130,0,130,8],[131,0,131,8],[111,0,111,8],[112,0,112,8],[113,0,113,8],[114,0,114,8],[146,0,146,8],[147,0,147,8],[148,0,148,8],[149,0,149,8],[150,0,150,8],[151,0,151,8],[141,0,141,8],[132,0,132,8],[133,0,133,8],[134,0,134,8],[135,0,135,8],[136,0,136,8],[137,0,137,8],[138,0,138,8],[139,0,139,8],[140,0,140,8],[115,0,115,8],[116,0,116,8],[117,0,117,8],[118,0,118,8],[119,0,119,8],[120,0,120,8],[101,0,101,8],[104,0,104,8],[103,0,103,8],[105,0,105,8],[106,0,106,8],[107,0,107,8],[108,0,108,8],[109,0,109,8],[110,0,110,8],[102,0,102,8],[100,0,100,8],[91,0,91,8],[80,0,80,8],[81,0,81,8],[82,0,82,8],[83,0,83,8],[84,0,84,8],[85,0,85,8],[86,0,86,8],[87,0,87,8],[88,0,88,8],[89,0,89,8],[90,0,90,8],[92,0,92,8],[93,0,93,8],[94,0,94,8],[95,0,95,8],[96,0,96,8],[97,0,97,8],[98,0,98,8],[99,0,99,8],[55,0,55,8],[56,0,56,8],[79,0,79,8],[74,0,74,8],[59,0,59,8],[60,0,60,8],[61,0,61,8],[62,0,62,8],[63,0,63,8],[64,0,64,8],[65,0,65,8],[66,0,66,8],[67,0,67,8],[68,0,68,8],[69,0,69,8],[70,0,70,8],[71,0,71,8],[72,0,72,8],[73,0,73,8],[75,0,75,8],[76,0,76,8],[77,0,77,8],[78,0,78,8],[2,0,2,1],[2,2,2,8],[3,0,4,8],[8,0,8,8],[9,0,9,8],[557,4,557,8],[26,0,26,8],[27,0,27,8],[58,0,58,8],[41,0,41,8],[42,0,42,8],[43,0,43,8],[44,0,44,8],[45,0,45,8],[46,0,46,8],[47,0,47,8],[159,0,159,8],[48,0,48,8],[49,0,49,8],[50,0,50,8],[51,0,51,8],[52,0,52,8],[53,0,53,8],[54,0,54,8]]}
[]
[]
[{"$f":"'GOEDGEKEURD BUDGET AJU'!I3","v":"2021/XX"},null,{"$f":"'STAP 1'!D11","v":0}]
["Bijkomende vragen omtrent financieel (eind)rapport \n"]
[]
[]
["ALGEMENE VRAGEN  "]
[]
["A.1. Gelieve XX, aub. "]
["A.2. Gelieve XX, aub. "]
["A.3. Gelieve XX, aub. "]
["A.4. Gelieve XX, aub. "]
["A.5. Gelieve XX, aub. "]
["A.6. Gelieve XX, aub. "]
["A.7. Gelieve XX, aub. "]
["A.8. Gelieve XX, aub. "]
["A.9. Gelieve XX, aub. "]
["A.10. Gelieve XX, aub. "]
[]
["VRAGEN PER SPECIFIEKE KOSTENRUBRIEK"]
[]
["PERSONEELSKOSTEN:"]
[]
[{"$f":"Personeelskosten!B6","v":"(naam in te vullen)"}]
[{"$f":"IF(Personeelskosten!V6=0, \"Geen vragen of bemerkingen\",Personeelskosten!V6)","v":"Geen vragen of bemerkingen"}]
[{"$f":"IF(Personeelskosten!V7=0, \"Geen vragen of bemerkingen\",Personeelskosten!V7)","v":"Geen vragen of bemerkingen"}]
[{"$f":"IF(Personeelskosten!V8=0, \"Geen vragen of bemerkingen\",Personeelskosten!V8)","v":"Geen vragen of bemerkingen"}]
[{"$f":"IF(Personeelskosten!V9=0, \"Geen vragen of bemerkingen\",Personeelskosten!V9)","v":"Geen vragen of bemerkingen"}]
[{"$f":"IF(Personeelskosten!V10=0, \"Geen vragen of bemerkingen\",Personeelskosten!V10)","v":"Geen vragen of bemerkingen"}]
[{"$f":"IF(Personeelskosten!V11=0, \"Geen vragen of bemerkingen\",Personeelskosten!V11)","v":"Geen vragen of bemerkingen"}]
[{"$f":"IF(Personeelskosten!V12=0, \"Geen vragen of bemerkingen\",Personeelskosten!V12)","v":"Geen vragen of bemerkingen"}]
[{"$f":"IF(Personeelskosten!V13=0, \"Geen vragen of bemerkingen\",Personeelskosten!V13)","v":"Geen vragen of bemerkingen"}]
[{"$f":"IF(Personeelskosten!V14=0, \"Geen vragen of bemerkingen\",Personeelskosten!V14)","v":"Geen vragen of bemerkingen"}]
[{"$f":"IF(Personeelskosten!V15=0, \"Geen vragen of bemerkingen\",Personeelskosten!V15)","v":"Geen vragen of bemerkingen"}]
[{"$f":"IF(Personeelskosten!V16=0, \"Geen vragen of bemerkingen\",Personeelskosten!V16)","v":"Geen vragen of bemerkingen"}]
[{"$f":"IF(Personeelskosten!V17=0, \"Geen vragen of bemerkingen\",Personeelskosten!V17)","v":"Geen vragen of bemerkingen"}]
[{"$f":"IF(Personeelskosten!V18=0, \"Geen vragen of bemerkingen\",Personeelskosten!V18)","v":"Geen vragen of bemerkingen"}]
[{"$f":"IF(Personeelskosten!V19=0, \"Geen vragen of bemerkingen\",Personeelskosten!V19)","v":"Geen vragen of bemerkingen"}]
[{"$f":"IF(Personeelskosten!V20=0, \"Geen vragen of bemerkingen\",Personeelskosten!V20)","v":"Geen vragen of bemerkingen"}]
[{"$f":"IF(Personeelskosten!V21=0, \"Geen vragen of bemerkingen\",Personeelskosten!V21)","v":"Geen vragen of bemerkingen"}]
[{"$f":"Personeelskosten!B22","v":"(naam in te vullen)"}]
[{"$f":"IF(Personeelskosten!V22=0, \"Geen vragen of bemerkingen\",Personeelskosten!V22)","v":"Geen vragen of bemerkingen"}]
[{"$f":"IF(Personeelskosten!V23=0, \"Geen vragen of bemerkingen\",Personeelskosten!V23)","v":"Geen vragen of bemerkingen"}]
[{"$f":"IF(Personeelskosten!V24=0, \"Geen vragen of bemerkingen\",Personeelskosten!V24)","v":"Geen vragen of bemerkingen"}]
[{"$f":"IF(Personeelskosten!V25=0, \"Geen vragen of bemerkingen\",Personeelskosten!V25)","v":"Geen vragen of bemerkingen"}]
[{"$f":"IF(Personeelskosten!V26=0, \"Geen vragen of bemerkingen\",Personeelskosten!V26)","v":"Geen vragen of bemerkingen"}]
[{"$f":"IF(Personeelskosten!V27=0, \"Geen vragen of bemerkingen\",Personeelskosten!V27)","v":"Geen vragen of bemerkingen"}]
[{"$f":"IF(Personeelskosten!V28=0, \"Geen vragen of bemerkingen\",Personeelskosten!V28)","v":"Geen vragen of bemerkingen"}]
[{"$f":"IF(Personeelskosten!V29=0, \"Geen vragen of bemerkingen\",Personeelskosten!V29)","v":"Geen vragen of bemerkingen"}]
[{"$f":"IF(Personeelskosten!V30=0, \"Geen vragen of bemerkingen\",Personeelskosten!V30)","v":"Geen vragen of bemerkingen"}]
[{"$f":"IF(Personeelskosten!V31=0, \"Geen vragen of bemerkingen\",Personeelskosten!V31)","v":"Geen vragen of bemerkingen"}]
[{"$f":"IF(Personeelskosten!V32=0, \"Geen vragen of bemerkingen\",Personeelskosten!V32)","v":"Geen vragen of bemerkingen"}]
[{"$f":"IF(Personeelskosten!V33=0, \"Geen vragen of bemerkingen\",Personeelskosten!V33)","v":"Geen vragen of bemerkingen"}]
[{"$f":"IF(Personeelskosten!V34=0, \"Geen vragen of bemerkingen\",Personeelskosten!V34)","v":"Geen vragen of bemerkingen"}]
[{"$f":"IF(Personeelskosten!V35=0, \"Geen vragen of bemerkingen\",Personeelskosten!V35)","v":"Geen vragen of bemerkingen"}]
[{"$f":"IF(Personeelskosten!V36=0, \"Geen vragen of bemerkingen\",Personeelskosten!V36)","v":"Geen vragen of bemerkingen"}]
[{"$f":"IF(Personeelskosten!V37=0, \"Geen vragen of bemerkingen\",Personeelskosten!V37)","v":"Geen vragen of bemerkingen"}]
[{"$f":"Personeelskosten!B38","v":"(naam in te vullen)"}]
[{"$f":"IF(Personeelskosten!V38=0, \"Geen vragen of bemerkingen\",Personeelskosten!V38)","v":"Geen vragen of bemerkingen"}]
[{"$f":"IF(Personeelskosten!V39=0, \"Geen vragen of bemerkingen\",Personeelskosten!V39)","v":"Geen vragen of bemerkingen"}]
[{"$f":"IF(Personeelskosten!V40=0, \"Geen vragen of bemerkingen\",Personeelskosten!V40)","v":"Geen vragen of bemerkingen"}]
[{"$f":"IF(Personeelskosten!V41=0, \"Geen vragen of bemerkingen\",Personeelskosten!V41)","v":"Geen vragen of bemerkingen"}]
[{"$f":"IF(Personeelskosten!V42=0, \"Geen vragen of bemerkingen\",Personeelskosten!V42)","v":"Geen vragen of bemerkingen"}]
[{"$f":"IF(Personeelskosten!V43=0, \"Geen vragen of bemerkingen\",Personeelskosten!V43)","v":"Geen vragen of bemerkingen"}]
[{"$f":"IF(Personeelskosten!V44=0, \"Geen vragen of bemerkingen\",Personeelskosten!V44)","v":"Geen vragen of bemerkingen"}]
[{"$f":"IF(Personeelskosten!V45=0, \"Geen vragen of bemerkingen\",Personeelskosten!V45)","v":"Geen vragen of bemerkingen"}]
[{"$f":"IF(Personeelskosten!V46=0, \"Geen vragen of bemerkingen\",Personeelskosten!V46)","v":"Geen vragen of bemerkingen"}]
[{"$f":"IF(Personeelskosten!V47=0, \"Geen vragen of bemerkingen\",Personeelskosten!V47)","v":"Geen vragen of bemerkingen"}]
[{"$f":"IF(Personeelskosten!V48=0, \"Geen vragen of bemerkingen\",Personeelskosten!V48)","v":"Geen vragen of bemerkingen"}]
[{"$f":"IF(Personeelskosten!V49=0, \"Geen vragen of bemerkingen\",Personeelskosten!V49)","v":"Geen vragen of bemerkingen"}]
[{"$f":"IF(Personeelskosten!V50=0, \"Geen vragen of bemerkingen\",Personeelskosten!V50)","v":"Geen vragen of bemerkingen"}]
[{"$f":"IF(Personeelskosten!V51=0, \"Geen vragen of bemerkingen\",Personeelskosten!V51)","v":"Geen vragen of bemerkingen"}]
[{"$f":"IF(Personeelskosten!V52=0, \"Geen vragen of bemerkingen\",Personeelskosten!V52)","v":"Geen vragen of bemerkingen"}]
[{"$f":"IF(Personeelskosten!V53=0, \"Geen vragen of bemerkingen\",Personeelskosten!V53)","v":"Geen vragen of bemerkingen"}]
[{"$f":"Personeelskosten!B54","v":"(naam in te vullen)"}]
[{"$f":"IF(Personeelskosten!V54=0, \"Geen vragen of bemerkingen\",Personeelskosten!V54)","v":"Geen vragen of bemerkingen"}]
[{"$f":"IF(Personeelskosten!V55=0, \"Geen vragen of bemerkingen\",Personeelskosten!V55)","v":"Geen vragen of bemerkingen"}]
[{"$f":"IF(Personeelskosten!V56=0, \"Geen vragen of bemerkingen\",Personeelskosten!V56)","v":"Geen vragen of bemerkingen"}]
[{"$f":"IF(Personeelskosten!V57=0, \"Geen vragen of bemerkingen\",Personeelskosten!V57)","v":"Geen vragen of bemerkingen"}]
[{"$f":"IF(Personeelskosten!V58=0, \"Geen vragen of bemerkingen\",Personeelskosten!V58)","v":"Geen vragen of bemerkingen"}]
[{"$f":"IF(Personeelskosten!V59=0, \"Geen vragen of bemerkingen\",Personeelskosten!V59)","v":"Geen vragen of bemerkingen"}]
[{"$f":"IF(Personeelskosten!V60=0, \"Geen vragen of bemerkingen\",Personeelskosten!V60)","v":"Geen vragen of bemerkingen"}]
[{"$f":"IF(Personeelskosten!V61=0, \"Geen vragen of bemerkingen\",Personeelskosten!V61)","v":"Geen vragen of bemerkingen"}]
[{"$f":"IF(Personeelskosten!V62=0, \"Geen vragen of bemerkingen\",Personeelskosten!V62)","v":"Geen vragen of bemerkingen"}]
[{"$f":"IF(Personeelskosten!V63=0, \"Geen vragen of bemerkingen\",Personeelskosten!V63)","v":"Geen vragen of bemerkingen"}]
[{"$f":"IF(Personeelskosten!V64=0, \"Geen vragen of bemerkingen\",Personeelskosten!V64)","v":"Geen vragen of bemerkingen"}]
[{"$f":"IF(Personeelskosten!V65=0, \"Geen vragen of bemerkingen\",Personeelskosten!V65)","v":"Geen vragen of bemerkingen"}]
[{"$f":"IF(Personeelskosten!V66=0, \"Geen vragen of bemerkingen\",Personeelskosten!V66)","v":"Geen vragen of bemerkingen"}]
[{"$f":"IF(Personeelskosten!V67=0, \"Geen vragen of bemerkingen\",Personeelskosten!V67)","v":"Geen vragen of bemerkingen"}]
[{"$f":"IF(Personeelskosten!V68=0, \"Geen vragen of bemerkingen\",Personeelskosten!V68)","v":"Geen vragen of bemerkingen"}]
[{"$f":"IF(Personeelskosten!V69=0, \"Geen vragen of bemerkingen\",Personeelskosten!V69)","v":"Geen vragen of bemerkingen"}]
[{"$f":"Personeelskosten!B70","v":"(naam in te vullen)"}]
[{"$f":"IF(Personeelskosten!V70=0, \"Geen vragen of bemerkingen\",Personeelskosten!V70)","v":"Geen vragen of bemerkingen"}]
[{"$f":"IF(Personeelskosten!V71=0, \"Geen vragen of bemerkingen\",Personeelskosten!V71)","v":"Geen vragen of bemerkingen"}]
[{"$f":"IF(Personeelskosten!V72=0, \"Geen vragen of bemerkingen\",Personeelskosten!V72)","v":"Geen vragen of bemerkingen"}]
[{"$f":"IF(Personeelskosten!V73=0, \"Geen vragen of bemerkingen\",Personeelskosten!V73)","v":"Geen vragen of bemerkingen"}]
[{"$f":"IF(Personeelskosten!V74=0, \"Geen vragen of bemerkingen\",Personeelskosten!V74)","v":"Geen vragen of bemerkingen"}]
[{"$f":"IF(Personeelskosten!V75=0, \"Geen vragen of bemerkingen\",Personeelskosten!V75)","v":"Geen vragen of bemerkingen"}]
[{"$f":"IF(Personeelskosten!V76=0, \"Geen vragen of bemerkingen\",Personeelskosten!V76)","v":"Geen vragen of bemerkingen"}]
[{"$f":"IF(Personeelskosten!V77=0, \"Geen vragen of bemerkingen\",Personeelskosten!V77)","v":"Geen vragen of bemerkingen"}]
[{"$f":"IF(Personeelskosten!V78=0, \"Geen vragen of bemerkingen\",Personeelskosten!V78)","v":"Geen vragen of bemerkingen"}]
[{"$f":"IF(Personeelskosten!V79=0, \"Geen vragen of bemerkingen\",Personeelskosten!V79)","v":"Geen vragen of bemerkingen"}]
[{"$f":"Personeelskosten!B86","v":"(naam in te vullen)"}]
[{"$f":"IF(Personeelskosten!V80=0, \"Geen vragen of bemerkingen\",Personeelskosten!V80)","v":"Geen vragen of bemerkingen"}]
[{"$f":"IF(Personeelskosten!V81=0, \"Geen vragen of bemerkingen\",Personeelskosten!V81)","v":"Geen vragen of bemerkingen"}]
[{"$f":"IF(Personeelskosten!V82=0, \"Geen vragen of bemerkingen\",Personeelskosten!V82)","v":"Geen vragen of bemerkingen"}]
[{"$f":"IF(Personeelskosten!V83=0, \"Geen vragen of bemerkingen\",Personeelskosten!V83)","v":"Geen vragen of bemerkingen"}]
[{"$f":"IF(Personeelskosten!V84=0, \"Geen vragen of bemerkingen\",Personeelskosten!V84)","v":"Geen vragen of bemerkingen"}]
[{"$f":"IF(Personeelskosten!V85=0, \"Geen vragen of bemerkingen\",Personeelskosten!V85)","v":"Geen vragen of bemerkingen"}]
[{"$f":"IF(Personeelskosten!V86=0, \"Geen vragen of bemerkingen\",Personeelskosten!V86)","v":"Geen vragen of bemerkingen"}]
[{"$f":"IF(Personeelskosten!V87=0, \"Geen vragen of bemerkingen\",Personeelskosten!V87)","v":"Geen vragen of bemerkingen"}]
[{"$f":"IF(Personeelskosten!V88=0, \"Geen vragen of bemerkingen\",Personeelskosten!V88)","v":"Geen vragen of bemerkingen"}]
[{"$f":"IF(Personeelskosten!V89=0, \"Geen vragen of bemerkingen\",Personeelskosten!V89)","v":"Geen vragen of bemerkingen"}]
[{"$f":"IF(Personeelskosten!V90=0, \"Geen vragen of bemerkingen\",Personeelskosten!V90)","v":"Geen vragen of bemerkingen"}]
[{"$f":"IF(Personeelskosten!V91=0, \"Geen vragen of bemerkingen\",Personeelskosten!V91)","v":"Geen vragen of bemerkingen"}]
[{"$f":"IF(Personeelskosten!V92=0, \"Geen vragen of bemerkingen\",Personeelskosten!V92)","v":"Geen vragen of bemerkingen"}]
[{"$f":"IF(Personeelskosten!V93=0, \"Geen vragen of bemerkingen\",Personeelskosten!V93)","v":"Geen vragen of bemerkingen"}]
[{"$f":"IF(Personeelskosten!V94=0, \"Geen vragen of bemerkingen\",Personeelskosten!V94)","v":"Geen vragen of bemerkingen"}]
[{"$f":"IF(Personeelskosten!V95=0, \"Geen vragen of bemerkingen\",Personeelskosten!V95)","v":"Geen vragen of bemerkingen"}]
[{"$f":"IF(Personeelskosten!V96=0, \"Geen vragen of bemerkingen\",Personeelskosten!V96)","v":"Geen vragen of bemerkingen"}]
[{"$f":"IF(Personeelskosten!V97=0, \"Geen vragen of bemerkingen\",Personeelskosten!V97)","v":"Geen vragen of bemerkingen"}]
[{"$f":"IF(Personeelskosten!V98=0, \"Geen vragen of bemerkingen\",Personeelskosten!V98)","v":"Geen vragen of bemerkingen"}]
[{"$f":"IF(Personeelskosten!V99=0, \"Geen vragen of bemerkingen\",Personeelskosten!V99)","v":"Geen vragen of bemerkingen"}]
[{"$f":"IF(Personeelskosten!V100=0, \"Geen vragen of bemerkingen\",Personeelskosten!V100)","v":"Geen vragen of bemerkingen"}]
[{"$f":"IF(Personeelskosten!V101=0, \"Geen vragen of bemerkingen\",Personeelskosten!V101)","v":"Geen vragen of bemerkingen"}]
[{"$f":"Personeelskosten!B102","v":"(naam in te vullen)"}]
[{"$f":"IF(Personeelskosten!V102=0, \"Geen vragen of bemerkingen\",Personeelskosten!V102)","v":"Geen vragen of bemerkingen"}]
[{"$f":"IF(Personeelskosten!V103=0, \"Geen vragen of bemerkingen\",Personeelskosten!V103)","v":"Geen vragen of bemerkingen"}]
[{"$f":"IF(Personeelskosten!V104=0, \"Geen vragen of bemerkingen\",Personeelskosten!V104)","v":"Geen vragen of bemerkingen"}]
[{"$f":"IF(Personeelskosten!V105=0, \"Geen vragen of bemerkingen\",Personeelskosten!V105)","v":"Geen vragen of bemerkingen"}]
[{"$f":"IF(Personeelskosten!V106=0, \"Geen vragen of bemerkingen\",Personeelskosten!V106)","v":"Geen vragen of bemerkingen"}]
[{"$f":"IF(Personeelskosten!V107=0, \"Geen vragen of bemerkingen\",Personeelskosten!V107)","v":"Geen vragen of bemerkingen"}]
[{"$f":"IF(Personeelskosten!V109=0, \"Geen vragen of bemerkingen\",Personeelskosten!V109)","v":"Geen vragen of bemerkingen"}]
[{"$f":"IF(Personeelskosten!V110=0, \"Geen vragen of bemerkingen\",Personeelskosten!V110)","v":"Geen vragen of bemerkingen"}]
[{"$f":"IF(Personeelskosten!V111=0, \"Geen vragen of bemerkingen\",Personeelskosten!V111)","v":"Geen vragen of bemerkingen"}]
[{"$f":"IF(Personeelskosten!V112=0, \"Geen vragen of bemerkingen\",Personeelskosten!V112)","v":"Geen vragen of bemerkingen"}]
[{"$f":"IF(Personeelskosten!V113=0, \"Geen vragen of bemerkingen\",Personeelskosten!V113)","v":"Geen vragen of bemerkingen"}]
[{"$f":"IF(Personeelskosten!V114=0, \"Geen vragen of bemerkingen\",Personeelskosten!V114)","v":"Geen vragen of bemerkingen"}]
[{"$f":"IF(Personeelskosten!V115=0, \"Geen vragen of bemerkingen\",Personeelskosten!V115)","v":"Geen vragen of bemerkingen"}]
[{"$f":"IF(Personeelskosten!V116=0, \"Geen vragen of bemerkingen\",Personeelskosten!V116)","v":"Geen vragen of bemerkingen"}]
[{"$f":"IF(Personeelskosten!V117=0, \"Geen vragen of bemerkingen\",Personeelskosten!V117)","v":"Geen vragen of bemerkingen"}]
[{"$f":"Personeelskosten!B118","v":"(naam in te vullen)"}]
[{"$f":"IF(Personeelskosten!V118=0, \"Geen vragen of bemerkingen\",Personeelskosten!V118)","v":"Geen vragen of bemerkingen"}]
[{"$f":"IF(Personeelskosten!V119=0, \"Geen vragen of bemerkingen\",Personeelskosten!V119)","v":"Geen vragen of bemerkingen"}]
[{"$f":"IF(Personeelskosten!V120=0, \"Geen vragen of bemerkingen\",Personeelskosten!V120)","v":"Geen vragen of bemerkingen"}]
[{"$f":"IF(Personeelskosten!V121=0, \"Geen vragen of bemerkingen\",Personeelskosten!V121)","v":"Geen vragen of bemerkingen"}]
[{"$f":"IF(Personeelskosten!V122=0, \"Geen vragen of bemerkingen\",Personeelskosten!V122)","v":"Geen vragen of bemerkingen"}]
[{"$f":"IF(Personeelskosten!V123=0, \"Geen vragen of bemerkingen\",Personeelskosten!V123)","v":"Geen vragen of bemerkingen"}]
[{"$f":"IF(Personeelskosten!V124=0, \"Geen vragen of bemerkingen\",Personeelskosten!V124)","v":"Geen vragen of bemerkingen"}]
[{"$f":"IF(Personeelskosten!V125=0, \"Geen vragen of bemerkingen\",Personeelskosten!V125)","v":"Geen vragen of bemerkingen"}]
[{"$f":"IF(Personeelskosten!V126=0, \"Geen vragen of bemerkingen\",Personeelskosten!V126)","v":"Geen vragen of bemerkingen"}]
[{"$f":"IF(Personeelskosten!V127=0, \"Geen vragen of bemerkingen\",Personeelskosten!V127)","v":"Geen vragen of bemerkingen"}]
[{"$f":"IF(Personeelskosten!V128=0, \"Geen vragen of bemerkingen\",Personeelskosten!V128)","v":"Geen vragen of bemerkingen"}]
[{"$f":"IF(Personeelskosten!V129=0, \"Geen vragen of bemerkingen\",Personeelskosten!V129)","v":"Geen vragen of bemerkingen"}]
[{"$f":"IF(Personeelskosten!V130=0, \"Geen vragen of bemerkingen\",Personeelskosten!V130)","v":"Geen vragen of bemerkingen"}]
[{"$f":"IF(Personeelskosten!V131=0, \"Geen vragen of bemerkingen\",Personeelskosten!V131)","v":"Geen vragen of bemerkingen"}]
[]
["HUUR:"]
[]
[{"$f":"IF(Huur!O6=0, \"Geen vragen of bemerkingen\",Huur!O6)","v":"Geen vragen of bemerkingen"}]
[{"$f":"IF(Huur!O7=0, \"Geen vragen of bemerkingen\",Huur!O7)","v":"Geen vragen of bemerkingen"}]
[{"$f":"IF(Huur!O8=0, \"Geen vragen of bemerkingen\",Huur!O8)","v":"Geen vragen of bemerkingen"}]
[{"$f":"IF(Huur!O9=0, \"Geen vragen of bemerkingen\",Huur!O9)","v":"Geen vragen of bemerkingen"}]
[{"$f":"IF(Huur!O10=0, \"Geen vragen of bemerkingen\",Huur!O10)","v":"Geen vragen of bemerkingen"}]
[{"$f":"IF(Huur!O11=0, \"Geen vragen of bemerkingen\",Huur!O11)","v":"Geen vragen of bemerkingen"}]
[{"$f":"IF(Huur!O12=0, \"Geen vragen of bemerkingen\",Huur!O12)","v":"Geen vragen of bemerkingen"}]
[{"$f":"IF(Huur!O13=0, \"Geen vragen of bemerkingen\",Huur!O13)","v":"Geen vragen of bemerkingen"}]
[{"$f":"IF(Huur!O14=0, \"Geen vragen of bemerkingen\",Huur!O14)","v":"Geen vragen of bemerkingen"}]
[{"$f":"IF(Huur!O15=0, \"Geen vragen of bemerkingen\",Huur!O15)","v":"Geen vragen of bemerkingen"}]
[{"$f":"IF(Huur!O16=0, \"Geen vragen of bemerkingen\",Huur!O16)","v":"Geen vragen of bemerkingen"}]
[{"$f":"IF(Huur!O17=0, \"Geen vragen of bemerkingen\",Huur!O17)","v":"Geen vragen of bemerkingen"}]
[{"$f":"IF(Huur!O18=0, \"Geen vragen of bemerkingen\",Huur!O18)","v":"Geen vragen of bemerkingen"}]
[]
["INVESTERINGEN:"]
[]
[{"$f":"IF(Investeringen!Q6=0, \"Geen vragen of bemerkingen\",Investeringen!Q6)","v":"Geen vragen of bemerkingen"}]
[{"$f":"IF(Investeringen!Q7=0, \"Geen vragen of bemerkingen\",Investeringen!Q7)","v":"Geen vragen of bemerkingen"}]
[{"$f":"IF(Investeringen!Q8=0, \"Geen vragen of bemerkingen\",Investeringen!Q8)","v":"Geen vragen of bemerkingen"}]
[{"$f":"IF(Investeringen!Q9=0, \"Geen vragen of bemerkingen\",Investeringen!Q9)","v":"Geen vragen of bemerkingen"}]
[{"$f":"IF(Investeringen!Q10=0, \"Geen vragen of bemerkingen\",Investeringen!Q10)","v":"Geen vragen of bemerkingen"}]
[]
["DIRECTE WERKINGSKOSTEN:"]
[]
[{"$f":"'Directe werkingskosten'!D6","v":"Kies uit lijst Directe Werkingskosten "}]
[]
[{"$f":"IF('Directe werkingskosten'!T6=0, \"Geen vragen of bemerkingen\",'Directe werkingskosten'!T6)","v":"Geen vragen of bemerkingen"}]
[{"$f":"IF('Directe werkingskosten'!T7=0, \"Geen vragen of bemerkingen\",'Directe werkingskosten'!T7)","v":"Geen vragen of bemerkingen"}]
[{"$f":"IF('Directe werkingskosten'!T8=0, \"Geen vragen of bemerkingen\",'Directe werkingskosten'!T8)","v":"Geen vragen of bemerkingen"}]
[{"$f":"IF('Directe werkingskosten'!T9=0, \"Geen vragen of bemerkingen\",'Directe werkingskosten'!T9)","v":"Geen vragen of bemerkingen"}]
[{"$f":"IF('Directe werkingskosten'!T10=0, \"Geen vragen of bemerkingen\",'Directe werkingskosten'!T10)","v":"Geen vragen of bemerkingen"}]
[{"$f":"IF('Directe werkingskosten'!T11=0, \"Geen vragen of bemerkingen\",'Directe werkingskosten'!T11)","v":"Geen vragen of bemerkingen"}]
[{"$f":"IF('Directe werkingskosten'!T12=0, \"Geen vragen of bemerkingen\",'Directe werkingskosten'!T12)","v":"Geen vragen of bemerkingen"}]
[{"$f":"IF('Directe werkingskosten'!T13=0, \"Geen vragen of bemerkingen\",'Directe werkingskosten'!T13)","v":"Geen vragen of bemerkingen"}]
[{"$f":"IF('Directe werkingskosten'!T14=0, \"Geen vragen of bemerkingen\",'Directe werkingskosten'!T14)","v":"Geen vragen of bemerkingen"}]
[{"$f":"IF('Directe werkingskosten'!T15=0, \"Geen vragen of bemerkingen\",'Directe werkingskosten'!T15)","v":"Geen vragen of bemerkingen"}]
[{"$f":"IF('Directe werkingskosten'!T16=0, \"Geen vragen of bemerkingen\",'Directe werkingskosten'!T16)","v":"Geen vragen of bemerkingen"}]
[{"$f":"IF('Directe werkingskosten'!T17=0, \"Geen vragen of bemerkingen\",'Directe werkingskosten'!T17)","v":"Geen vragen of bemerkingen"}]
[{"$f":"IF('Directe werkingskosten'!T18=0, \"Geen vragen of bemerkingen\",'Directe werkingskosten'!T18)","v":"Geen vragen of bemerkingen"}]
[]
[{"$f":"'Directe werkingskosten'!D19","v":"Kies uit lijst Directe Werkingskosten "}]
[]
[{"$f":"IF('Directe werkingskosten'!T19=0, \"Geen vragen of bemerkingen\",'Directe werkingskosten'!T19)","v":"Geen vragen of bemerkingen"}]
[{"$f":"IF('Directe werkingskosten'!T20=0, \"Geen vragen of bemerkingen\",'Directe werkingskosten'!T20)","v":"Geen vragen of bemerkingen"}]
[{"$f":"IF('Directe werkingskosten'!T21=0, \"Geen vragen of bemerkingen\",'Directe werkingskosten'!T21)","v":"Geen vragen of bemerkingen"}]
[{"$f":"IF('Directe werkingskosten'!T22=0, \"Geen vragen of bemerkingen\",'Directe werkingskosten'!T22)","v":"Geen vragen of bemerkingen"}]
[{"$f":"IF('Directe werkingskosten'!T23=0, \"Geen vragen of bemerkingen\",'Directe werkingskosten'!T23)","v":"Geen vragen of bemerkingen"}]
[{"$f":"IF('Directe werkingskosten'!T24=0, \"Geen vragen of bemerkingen\",'Directe werkingskosten'!T24)","v":"Geen vragen of bemerkingen"}]
[{"$f":"IF('Directe werkingskosten'!T25=0, \"Geen vragen of bemerkingen\",'Directe werkingskosten'!T25)","v":"Geen vragen of bemerkingen"}]
[{"$f":"IF('Directe werkingskosten'!T26=0, \"Geen vragen of bemerkingen\",'Directe werkingskosten'!T26)","v":"Geen vragen of bemerkingen"}]
[{"$f":"IF('Directe werkingskosten'!T27=0, \"Geen vragen of bemerkingen\",'Directe werkingskosten'!T27)","v":"Geen vragen of bemerkingen"}]
[{"$f":"IF('Directe werkingskosten'!T28=0, \"Geen vragen of bemerkingen\",'Directe werkingskosten'!T28)","v":"Geen vragen of bemerkingen"}]
[{"$f":"IF('Directe werkingskosten'!T29=0, \"Geen vragen of bemerkingen\",'Directe werkingskosten'!T29)","v":"Geen vragen of bemerkingen"}]
[{"$f":"IF('Directe werkingskosten'!T30=0, \"Geen vragen of bemerkingen\",'Directe werkingskosten'!T30)","v":"Geen vragen of bemerkingen"}]
[{"$f":"IF('Directe werkingskosten'!T31=0, \"Geen vragen of bemerkingen\",'Directe werkingskosten'!T31)","v":"Geen vragen of bemerkingen"}]
[]
[{"$f":"'Directe werkingskosten'!D32","v":"Kies uit lijst Directe Werkingskosten "}]
[]
[{"$f":"IF('Directe werkingskosten'!T32=0, \"Geen vragen of bemerkingen\",'Directe werkingskosten'!T32)","v":"Geen vragen of bemerkingen"}]
[{"$f":"IF('Directe werkingskosten'!T33=0, \"Geen vragen of bemerkingen\",'Directe werkingskosten'!T33)","v":"Geen vragen of bemerkingen"}]
[{"$f":"IF('Directe werkingskosten'!T34=0, \"Geen vragen of bemerkingen\",'Directe werkingskosten'!T34)","v":"Geen vragen of bemerkingen"}]
[{"$f":"IF('Directe werkingskosten'!T35=0, \"Geen vragen of bemerkingen\",'Directe werkingskosten'!T35)","v":"Geen vragen of bemerkingen"}]
[{"$f":"IF('Directe werkingskosten'!T36=0, \"Geen vragen of bemerkingen\",'Directe werkingskosten'!T36)","v":"Geen vragen of bemerkingen"}]
[{"$f":"IF('Directe werkingskosten'!T37=0, \"Geen vragen of bemerkingen\",'Directe werkingskosten'!T37)","v":"Geen vragen of bemerkingen"}]
[{"$f":"IF('Directe werkingskosten'!T38=0, \"Geen vragen of bemerkingen\",'Directe werkingskosten'!T38)","v":"Geen vragen of bemerkingen"}]
[{"$f":"IF('Directe werkingskosten'!T39=0, \"Geen vragen of bemerkingen\",'Directe werkingskosten'!T39)","v":"Geen vragen of bemerkingen"}]
[{"$f":"IF('Directe werkingskosten'!T40=0, \"Geen vragen of bemerkingen\",'Directe werkingskosten'!T40)","v":"Geen vragen of bemerkingen"}]
[{"$f":"IF('Directe werkingskosten'!T41=0, \"Geen vragen of bemerkingen\",'Directe werkingskosten'!T41)","v":"Geen vragen of bemerkingen"}]
[{"$f":"IF('Directe werkingskosten'!T42=0, \"Geen vragen of bemerkingen\",'Directe werkingskosten'!T42)","v":"Geen vragen of bemerkingen"}]
[{"$f":"IF('Directe werkingskosten'!T43=0, \"Geen vragen of bemerkingen\",'Directe werkingskosten'!T43)","v":"Geen vragen of bemerkingen"}]
[{"$f":"IF('Directe werkingskosten'!T44=0, \"Geen vragen of bemerkingen\",'Directe werkingskosten'!T44)","v":"Geen vragen of bemerkingen"}]
[]
[{"$f":"'Directe werkingskosten'!D45","v":"Kies uit lijst Directe Werkingskosten "}]
[]
[{"$f":"IF('Directe werkingskosten'!T45=0, \"Geen vragen of bemerkingen\",'Directe werkingskosten'!T45)","v":"Geen vragen of bemerkingen"}]
[{"$f":"IF('Directe werkingskosten'!T46=0, \"Geen vragen of bemerkingen\",'Directe werkingskosten'!T46)","v":"Geen vragen of bemerkingen"}]
[{"$f":"IF('Directe werkingskosten'!T47=0, \"Geen vragen of bemerkingen\",'Directe werkingskosten'!T47)","v":"Geen vragen of bemerkingen"}]
[{"$f":"IF('Directe werkingskosten'!T48=0, \"Geen vragen of bemerkingen\",'Directe werkingskosten'!T48)","v":"Geen vragen of bemerkingen"}]
[{"$f":"IF('Directe werkingskosten'!T49=0, \"Geen vragen of bemerkingen\",'Directe werkingskosten'!T49)","v":"Geen vragen of bemerkingen"}]
[{"$f":"IF('Directe werkingskosten'!T50=0, \"Geen vragen of bemerkingen\",'Directe werkingskosten'!T50)","v":"Geen vragen of bemerkingen"}]
[{"$f":"IF('Directe werkingskosten'!T51=0, \"Geen vragen of bemerkingen\",'Directe werkingskosten'!T51)","v":"Geen vragen of bemerkingen"}]
[{"$f":"IF('Directe werkingskosten'!T52=0, \"Geen vragen of bemerkingen\",'Directe werkingskosten'!T52)","v":"Geen vragen of bemerkingen"}]
[{"$f":"IF('Directe werkingskosten'!T53=0, \"Geen vragen of bemerkingen\",'Directe werkingskosten'!T53)","v":"Geen vragen of bemerkingen"}]
[{"$f":"IF('Directe werkingskosten'!T54=0, \"Geen vragen of bemerkingen\",'Directe werkingskosten'!T54)","v":"Geen vragen of bemerkingen"}]
[{"$f":"IF('Directe werkingskosten'!T55=0, \"Geen vragen of bemerkingen\",'Directe werkingskosten'!T55)","v":"Geen vragen of bemerkingen"}]
[{"$f":"IF('Directe werkingskosten'!T56=0, \"Geen vragen of bemerkingen\",'Directe werkingskosten'!T56)","v":"Geen vragen of bemerkingen"}]
[{"$f":"IF('Directe werkingskosten'!T57=0, \"Geen vragen of bemerkingen\",'Directe werkingskosten'!T57)","v":"Geen vragen of bemerkingen"}]
[]
[{"$f":"'Directe werkingskosten'!D58","v":"Kies uit lijst Directe Werkingskosten "}]
[]
[{"$f":"IF('Directe werkingskosten'!T58=0, \"Geen vragen of bemerkingen\",'Directe werkingskosten'!T58)","v":"Geen vragen of bemerkingen"}]
[{"$f":"IF('Directe werkingskosten'!T59=0, \"Geen vragen of bemerkingen\",'Directe werkingskosten'!T59)","v":"Geen vragen of bemerkingen"}]
[{"$f":"IF('Directe werkingskosten'!T60=0, \"Geen vragen of bemerkingen\",'Directe werkingskosten'!T60)","v":"Geen vragen of bemerkingen"}]
[{"$f":"IF('Directe werkingskosten'!T61=0, \"Geen vragen of bemerkingen\",'Directe werkingskosten'!T61)","v":"Geen vragen of bemerkingen"}]
[{"$f":"IF('Directe werkingskosten'!T62=0, \"Geen vragen of bemerkingen\",'Directe werkingskosten'!T62)","v":"Geen vragen of bemerkingen"}]
[{"$f":"IF('Directe werkingskosten'!T63=0, \"Geen vragen of bemerkingen\",'Directe werkingskosten'!T63)","v":"Geen vragen of bemerkingen"}]
[{"$f":"IF('Directe werkingskosten'!T64=0, \"Geen vragen of bemerkingen\",'Directe werkingskosten'!T64)","v":"Geen vragen of bemerkingen"}]
[{"$f":"IF('Directe werkingskosten'!T65=0, \"Geen vragen of bemerkingen\",'Directe werkingskosten'!T65)","v":"Geen vragen of bemerkingen"}]
[{"$f":"IF('Directe werkingskosten'!T66=0, \"Geen vragen of bemerkingen\",'Directe werkingskosten'!T66)","v":"Geen vragen of bemerkingen"}]
[{"$f":"IF('Directe werkingskosten'!T67=0, \"Geen vragen of bemerkingen\",'Directe werkingskosten'!T67)","v":"Geen vragen of bemerkingen"}]
[{"$f":"IF('Directe werkingskosten'!T68=0, \"Geen vragen of bemerkingen\",'Directe werkingskosten'!T68)","v":"Geen vragen of bemerkingen"}]
[{"$f":"IF('Directe werkingskosten'!T69=0, \"Geen vragen of bemerkingen\",'Directe werkingskosten'!T69)","v":"Geen vragen of bemerkingen"}]
[{"$f":"IF('Directe werkingskosten'!T70=0, \"Geen vragen of bemerkingen\",'Directe werkingskosten'!T70)","v":"Geen vragen of bemerkingen"}]
[]
[{"$f":"'Directe werkingskosten'!D71","v":"Kies uit lijst Directe Werkingskosten "}]
[]
[{"$f":"IF('Directe werkingskosten'!T71=0, \"Geen vragen of bemerkingen\",'Directe werkingskosten'!T71)","v":"Geen vragen of bemerkingen"}]
[{"$f":"IF('Directe werkingskosten'!T72=0, \"Geen vragen of bemerkingen\",'Directe werkingskosten'!T72)","v":"Geen vragen of bemerkingen"}]
[{"$f":"IF('Directe werkingskosten'!T73=0, \"Geen vragen of bemerkingen\",'Directe werkingskosten'!T73)","v":"Geen vragen of bemerkingen"}]
[{"$f":"IF('Directe werkingskosten'!T74=0, \"Geen vragen of bemerkingen\",'Directe werkingskosten'!T74)","v":"Geen vragen of bemerkingen"}]
[{"$f":"IF('Directe werkingskosten'!T75=0, \"Geen vragen of bemerkingen\",'Directe werkingskosten'!T75)","v":"Geen vragen of bemerkingen"}]
[{"$f":"IF('Directe werkingskosten'!T76=0, \"Geen vragen of bemerkingen\",'Directe werkingskosten'!T76)","v":"Geen vragen of bemerkingen"}]
[{"$f":"IF('Directe werkingskosten'!T77=0, \"Geen vragen of bemerkingen\",'Directe werkingskosten'!T77)","v":"Geen vragen of bemerkingen"}]
[{"$f":"IF('Directe werkingskosten'!T78=0, \"Geen vragen of bemerkingen\",'Directe werkingskosten'!T78)","v":"Geen vragen of bemerkingen"}]
[{"$f":"IF('Directe werkingskosten'!T79=0, \"Geen vragen of bemerkingen\",'Directe werkingskosten'!T79)","v":"Geen vragen of bemerkingen"}]
[{"$f":"IF('Directe werkingskosten'!T80=0, \"Geen vragen of bemerkingen\",'Directe werkingskosten'!T80)","v":"Geen vragen of bemerkingen"}]
[{"$f":"IF('Directe werkingskosten'!T81=0, \"Geen vragen of bemerkingen\",'Directe werkingskosten'!T81)","v":"Geen vragen of bemerkingen"}]
[{"$f":"IF('Directe werkingskosten'!T82=0, \"Geen vragen of bemerkingen\",'Directe werkingskosten'!T82)","v":"Geen vragen of bemerkingen"}]
[{"$f":"IF('Directe werkingskosten'!T83=0, \"Geen vragen of bemerkingen\",'Directe werkingskosten'!T83)","v":"Geen vragen of bemerkingen"}]
[]
[{"$f":"'Directe werkingskosten'!D84","v":"Kies uit lijst Directe Werkingskosten "}]
[]
[{"$f":"IF('Directe werkingskosten'!T84=0, \"Geen vragen of bemerkingen\",'Directe werkingskosten'!T84)","v":"Geen vragen of bemerkingen"}]
[{"$f":"IF('Directe werkingskosten'!T85=0, \"Geen vragen of bemerkingen\",'Directe werkingskosten'!T85)","v":"Geen vragen of bemerkingen"}]
[{"$f":"IF('Directe werkingskosten'!T86=0, \"Geen vragen of bemerkingen\",'Directe werkingskosten'!T86)","v":"Geen vragen of bemerkingen"}]
[{"$f":"IF('Directe werkingskosten'!T87=0, \"Geen vragen of bemerkingen\",'Directe werkingskosten'!T87)","v":"Geen vragen of bemerkingen"}]
[{"$f":"IF('Directe werkingskosten'!T88=0, \"Geen vragen of bemerkingen\",'Directe werkingskosten'!T88)","v":"Geen vragen of bemerkingen"}]
[{"$f":"IF('Directe werkingskosten'!T89=0, \"Geen vragen of bemerkingen\",'Directe werkingskosten'!T89)","v":"Geen vragen of bemerkingen"}]
[{"$f":"IF('Directe werkingskosten'!T90=0, \"Geen vragen of bemerkingen\",'Directe werkingskosten'!T90)","v":"Geen vragen of bemerkingen"}]
[{"$f":"IF('Directe werkingskosten'!T91=0, \"Geen vragen of bemerkingen\",'Directe werkingskosten'!T91)","v":"Geen vragen of bemerkingen"}]
[{"$f":"IF('Directe werkingskosten'!T92=0, \"Geen vragen of bemerkingen\",'Directe werkingskosten'!T92)","v":"Geen vragen of bemerkingen"}]
[{"$f":"IF('Directe werkingskosten'!T93=0, \"Geen vragen of bemerkingen\",'Directe werkingskosten'!T93)","v":"Geen vragen of bemerkingen"}]
[{"$f":"IF('Directe werkingskosten'!T94=0, \"Geen vragen of bemerkingen\",'Directe werkingskosten'!T94)","v":"Geen vragen of bemerkingen"}]
[{"$f":"IF('Directe werkingskosten'!T95=0, \"Geen vragen of bemerkingen\",'Directe werkingskosten'!T95)","v":"Geen vragen of bemerkingen"}]
[{"$f":"IF('Directe werkingskosten'!T96=0, \"Geen vragen of bemerkingen\",'Directe werkingskosten'!T96)","v":"Geen vragen of bemerkingen"}]
[]
[{"$f":"'Directe werkingskosten'!D97","v":"Kies uit lijst Directe Werkingskosten "}]
[]
[{"$f":"IF('Directe werkingskosten'!T97=0, \"Geen vragen of bemerkingen\",'Directe werkingskosten'!T97)","v":"Geen vragen of bemerkingen"}]
[{"$f":"IF('Directe werkingskosten'!T98=0, \"Geen vragen of bemerkingen\",'Directe werkingskosten'!T98)","v":"Geen vragen of bemerkingen"}]
[{"$f":"IF('Directe werkingskosten'!T99=0, \"Geen vragen of bemerkingen\",'Directe werkingskosten'!T99)","v":"Geen vragen of bemerkingen"}]
[{"$f":"IF('Directe werkingskosten'!T100=0, \"Geen vragen of bemerkingen\",'Directe werkingskosten'!T100)","v":"Geen vragen of bemerkingen"}]
[{"$f":"IF('Directe werkingskosten'!T101=0, \"Geen vragen of bemerkingen\",'Directe werkingskosten'!T101)","v":"Geen vragen of bemerkingen"}]
[{"$f":"IF('Directe werkingskosten'!T102=0, \"Geen vragen of bemerkingen\",'Directe werkingskosten'!T102)","v":"Geen vragen of bemerkingen"}]
[{"$f":"IF('Directe werkingskosten'!T103=0, \"Geen vragen of bemerkingen\",'Directe werkingskosten'!T103)","v":"Geen vragen of bemerkingen"}]
[{"$f":"IF('Directe werkingskosten'!T104=0, \"Geen vragen of bemerkingen\",'Directe werkingskosten'!T104)","v":"Geen vragen of bemerkingen"}]
[{"$f":"IF('Directe werkingskosten'!T105=0, \"Geen vragen of bemerkingen\",'Directe werkingskosten'!T105)","v":"Geen vragen of bemerkingen"}]
[{"$f":"IF('Directe werkingskosten'!T106=0, \"Geen vragen of bemerkingen\",'Directe werkingskosten'!T106)","v":"Geen vragen of bemerkingen"}]
[{"$f":"IF('Directe werkingskosten'!T107=0, \"Geen vragen of bemerkingen\",'Directe werkingskosten'!T107)","v":"Geen vragen of bemerkingen"}]
[{"$f":"IF('Directe werkingskosten'!T108=0, \"Geen vragen of bemerkingen\",'Directe werkingskosten'!T108)","v":"Geen vragen of bemerkingen"}]
[{"$f":"IF('Directe werkingskosten'!T109=0, \"Geen vragen of bemerkingen\",'Directe werkingskosten'!T109)","v":"Geen vragen of bemerkingen"}]
[]
[{"$f":"'Directe werkingskosten'!D110","v":"Kies uit lijst Directe Werkingskosten "}]
[]
[{"$f":"IF('Directe werkingskosten'!T110=0, \"Geen vragen of bemerkingen\",'Directe werkingskosten'!T110)","v":"Geen vragen of bemerkingen"}]
[{"$f":"IF('Directe werkingskosten'!T111=0, \"Geen vragen of bemerkingen\",'Directe werkingskosten'!T111)","v":"Geen vragen of bemerkingen"}]
[{"$f":"IF('Directe werkingskosten'!T112=0, \"Geen vragen of bemerkingen\",'Directe werkingskosten'!T112)","v":"Geen vragen of bemerkingen"}]
[{"$f":"IF('Directe werkingskosten'!T113=0, \"Geen vragen of bemerkingen\",'Directe werkingskosten'!T113)","v":"Geen vragen of bemerkingen"}]
[{"$f":"IF('Directe werkingskosten'!T114=0, \"Geen vragen of bemerkingen\",'Directe werkingskosten'!T114)","v":"Geen vragen of bemerkingen"}]
[{"$f":"IF('Directe werkingskosten'!T115=0, \"Geen vragen of bemerkingen\",'Directe werkingskosten'!T115)","v":"Geen vragen of bemerkingen"}]
[{"$f":"IF('Directe werkingskosten'!T116=0, \"Geen vragen of bemerkingen\",'Directe werkingskosten'!T116)","v":"Geen vragen of bemerkingen"}]
[{"$f":"IF('Directe werkingskosten'!T117=0, \"Geen vragen of bemerkingen\",'Directe werkingskosten'!T117)","v":"Geen vragen of bemerkingen"}]
[{"$f":"IF('Directe werkingskosten'!T118=0, \"Geen vragen of bemerkingen\",'Directe werkingskosten'!T118)","v":"Geen vragen of bemerkingen"}]
[{"$f":"IF('Directe werkingskosten'!T119=0, \"Geen vragen of bemerkingen\",'Directe werkingskosten'!T119)","v":"Geen vragen of bemerkingen"}]
[{"$f":"IF('Directe werkingskosten'!T120=0, \"Geen vragen of bemerkingen\",'Directe werkingskosten'!T120)","v":"Geen vragen of bemerkingen"}]
[{"$f":"IF('Directe werkingskosten'!T121=0, \"Geen vragen of bemerkingen\",'Directe werkingskosten'!T121)","v":"Geen vragen of bemerkingen"}]
[{"$f":"IF('Directe werkingskosten'!T122=0, \"Geen vragen of bemerkingen\",'Directe werkingskosten'!T122)","v":"Geen vragen of bemerkingen"}]
[]
[{"$f":"'Directe werkingskosten'!D123","v":"Andere: (zelf in te vullen) "}]
[]
[{"$f":"IF('Directe werkingskosten'!T123=0, \"Geen vragen of bemerkingen\",'Directe werkingskosten'!T123)","v":"Geen vragen of bemerkingen"}]
[{"$f":"IF('Directe werkingskosten'!T124=0, \"Geen vragen of bemerkingen\",'Directe werkingskosten'!T124)","v":"Geen vragen of bemerkingen"}]
[{"$f":"IF('Directe werkingskosten'!T125=0, \"Geen vragen of bemerkingen\",'Directe werkingskosten'!T125)","v":"Geen vragen of bemerkingen"}]
[{"$f":"IF('Directe werkingskosten'!T126=0, \"Geen vragen of bemerkingen\",'Directe werkingskosten'!T126)","v":"Geen vragen of bemerkingen"}]
[{"$f":"IF('Directe werkingskosten'!T127=0, \"Geen vragen of bemerkingen\",'Directe werkingskosten'!T127)","v":"Geen vragen of bemerkingen"}]
[{"$f":"IF('Directe werkingskosten'!T128=0, \"Geen vragen of bemerkingen\",'Directe werkingskosten'!T128)","v":"Geen vragen of bemerkingen"}]
[{"$f":"IF('Directe werkingskosten'!T129=0, \"Geen vragen of bemerkingen\",'Directe werkingskosten'!T129)","v":"Geen vragen of bemerkingen"}]
[{"$f":"IF('Directe werkingskosten'!T130=0, \"Geen vragen of bemerkingen\",'Directe werkingskosten'!T130)","v":"Geen vragen of bemerkingen"}]
[{"$f":"IF('Directe werkingskosten'!T131=0, \"Geen vragen of bemerkingen\",'Directe werkingskosten'!T131)","v":"Geen vragen of bemerkingen"}]
[{"$f":"IF('Directe werkingskosten'!T132=0, \"Geen vragen of bemerkingen\",'Directe werkingskosten'!T132)","v":"Geen vragen of bemerkingen"}]
[{"$f":"IF('Directe werkingskosten'!T133=0, \"Geen vragen of bemerkingen\",'Directe werkingskosten'!T133)","v":"Geen vragen of bemerkingen"}]
[{"$f":"IF('Directe werkingskosten'!T134=0, \"Geen vragen of bemerkingen\",'Directe werkingskosten'!T134)","v":"Geen vragen of bemerkingen"}]
[{"$f":"IF('Directe werkingskosten'!T135=0, \"Geen vragen of bemerkingen\",'Directe werkingskosten'!T135)","v":"Geen vragen of bemerkingen"}]
[]
[{"$f":"'Directe werkingskosten'!D136","v":"Andere: (zelf in te vullen) "}]
[]
[{"$f":"IF('Directe werkingskosten'!T136=0, \"Geen vragen of bemerkingen\",'Directe werkingskosten'!T136)","v":"Geen vragen of bemerkingen"}]
[{"$f":"IF('Directe werkingskosten'!T137=0, \"Geen vragen of bemerkingen\",'Directe werkingskosten'!T137)","v":"Geen vragen of bemerkingen"}]
[{"$f":"IF('Directe werkingskosten'!T138=0, \"Geen vragen of bemerkingen\",'Directe werkingskosten'!T138)","v":"Geen vragen of bemerkingen"}]
[{"$f":"IF('Directe werkingskosten'!T139=0, \"Geen vragen of bemerkingen\",'Directe werkingskosten'!T139)","v":"Geen vragen of bemerkingen"}]
[{"$f":"IF('Directe werkingskosten'!T140=0, \"Geen vragen of bemerkingen\",'Directe werkingskosten'!T140)","v":"Geen vragen of bemerkingen"}]
[{"$f":"IF('Directe werkingskosten'!T141=0, \"Geen vragen of bemerkingen\",'Directe werkingskosten'!T141)","v":"Geen vragen of bemerkingen"}]
[{"$f":"IF('Directe werkingskosten'!T142=0, \"Geen vragen of bemerkingen\",'Directe werkingskosten'!T142)","v":"Geen vragen of bemerkingen"}]
[{"$f":"IF('Directe werkingskosten'!T143=0, \"Geen vragen of bemerkingen\",'Directe werkingskosten'!T143)","v":"Geen vragen of bemerkingen"}]
[{"$f":"IF('Directe werkingskosten'!T144=0, \"Geen vragen of bemerkingen\",'Directe werkingskosten'!T144)","v":"Geen vragen of bemerkingen"}]
[{"$f":"IF('Directe werkingskosten'!T145=0, \"Geen vragen of bemerkingen\",'Directe werkingskosten'!T145)","v":"Geen vragen of bemerkingen"}]
[{"$f":"IF('Directe werkingskosten'!T146=0, \"Geen vragen of bemerkingen\",'Directe werkingskosten'!T146)","v":"Geen vragen of bemerkingen"}]
[{"$f":"IF('Directe werkingskosten'!T147=0, \"Geen vragen of bemerkingen\",'Directe werkingskosten'!T147)","v":"Geen vragen of bemerkingen"}]
[{"$f":"IF('Directe werkingskosten'!T148=0, \"Geen vragen of bemerkingen\",'Directe werkingskosten'!T148)","v":"Geen vragen of bemerkingen"}]
[{"$f":"IF('Directe werkingskosten'!T149=0, \"Geen vragen of bemerkingen\",'Directe werkingskosten'!T149)","v":"Geen vragen of bemerkingen"}]
[]
["ANDERE WERKINGSKOSTEN:"]
[]
[{"$f":"'Indirecte werkingskosten'!D6","v":"Kies uit lijst Indirecte Werkingskosten"}]
[]
[{"$f":"IF('Indirecte werkingskosten'!P6=0, \"Geen vragen of bemerkingen\",'Indirecte werkingskosten'!P6)","v":"Geen vragen of bemerkingen"}]
[{"$f":"IF('Indirecte werkingskosten'!P7=0, \"Geen vragen of bemerkingen\",'Indirecte werkingskosten'!P7)","v":"Geen vragen of bemerkingen"}]
[{"$f":"IF('Indirecte werkingskosten'!P8=0, \"Geen vragen of bemerkingen\",'Indirecte werkingskosten'!P8)","v":"Geen vragen of bemerkingen"}]
[{"$f":"IF('Indirecte werkingskosten'!P9=0, \"Geen vragen of bemerkingen\",'Indirecte werkingskosten'!P9)","v":"Geen vragen of bemerkingen"}]
[{"$f":"IF('Indirecte werkingskosten'!P10=0, \"Geen vragen of bemerkingen\",'Indirecte werkingskosten'!P10)","v":"Geen vragen of bemerkingen"}]
[{"$f":"IF('Indirecte werkingskosten'!P11=0, \"Geen vragen of bemerkingen\",'Indirecte werkingskosten'!P11)","v":"Geen vragen of bemerkingen"}]
[{"$f":"IF('Indirecte werkingskosten'!P12=0, \"Geen vragen of bemerkingen\",'Indirecte werkingskosten'!P12)","v":"Geen vragen of bemerkingen"}]
[{"$f":"IF('Indirecte werkingskosten'!P13=0, \"Geen vragen of bemerkingen\",'Indirecte werkingskosten'!P13)","v":"Geen vragen of bemerkingen"}]
[{"$f":"IF('Indirecte werkingskosten'!P14=0, \"Geen vragen of bemerkingen\",'Indirecte werkingskosten'!P14)","v":"Geen vragen of bemerkingen"}]
[{"$f":"IF('Indirecte werkingskosten'!P15=0, \"Geen vragen of bemerkingen\",'Indirecte werkingskosten'!P15)","v":"Geen vragen of bemerkingen"}]
[{"$f":"IF('Indirecte werkingskosten'!P16=0, \"Geen vragen of bemerkingen\",'Indirecte werkingskosten'!P16)","v":"Geen vragen of bemerkingen"}]
[{"$f":"IF('Indirecte werkingskosten'!P17=0, \"Geen vragen of bemerkingen\",'Indirecte werkingskosten'!P17)","v":"Geen vragen of bemerkingen"}]
[{"$f":"IF('Indirecte werkingskosten'!P18=0, \"Geen vragen of bemerkingen\",'Indirecte werkingskosten'!P18)","v":"Geen vragen of bemerkingen"}]
[]
[{"$f":"'Indirecte werkingskosten'!D19","v":"Kies uit lijst Indirecte Werkingskosten"}]
[]
[{"$f":"IF('Indirecte werkingskosten'!P19=0, \"Geen vragen of bemerkingen\",'Indirecte werkingskosten'!P19)","v":"Geen vragen of bemerkingen"}]
[{"$f":"IF('Indirecte werkingskosten'!P20=0, \"Geen vragen of bemerkingen\",'Indirecte werkingskosten'!P20)","v":"Geen vragen of bemerkingen"}]
[{"$f":"IF('Indirecte werkingskosten'!P21=0, \"Geen vragen of bemerkingen\",'Indirecte werkingskosten'!P21)","v":"Geen vragen of bemerkingen"}]
[{"$f":"IF('Indirecte werkingskosten'!P22=0, \"Geen vragen of bemerkingen\",'Indirecte werkingskosten'!P22)","v":"Geen vragen of bemerkingen"}]
[{"$f":"IF('Indirecte werkingskosten'!P23=0, \"Geen vragen of bemerkingen\",'Indirecte werkingskosten'!P23)","v":"Geen vragen of bemerkingen"}]
[{"$f":"IF('Indirecte werkingskosten'!P24=0, \"Geen vragen of bemerkingen\",'Indirecte werkingskosten'!P24)","v":"Geen vragen of bemerkingen"}]
[{"$f":"IF('Indirecte werkingskosten'!P25=0, \"Geen vragen of bemerkingen\",'Indirecte werkingskosten'!P25)","v":"Geen vragen of bemerkingen"}]
[{"$f":"IF('Indirecte werkingskosten'!P26=0, \"Geen vragen of bemerkingen\",'Indirecte werkingskosten'!P26)","v":"Geen vragen of bemerkingen"}]
[{"$f":"IF('Indirecte werkingskosten'!P27=0, \"Geen vragen of bemerkingen\",'Indirecte werkingskosten'!P27)","v":"Geen vragen of bemerkingen"}]
[{"$f":"IF('Indirecte werkingskosten'!P28=0, \"Geen vragen of bemerkingen\",'Indirecte werkingskosten'!P28)","v":"Geen vragen of bemerkingen"}]
[{"$f":"IF('Indirecte werkingskosten'!P29=0, \"Geen vragen of bemerkingen\",'Indirecte werkingskosten'!P29)","v":"Geen vragen of bemerkingen"}]
[{"$f":"IF('Indirecte werkingskosten'!P30=0, \"Geen vragen of bemerkingen\",'Indirecte werkingskosten'!P30)","v":"Geen vragen of bemerkingen"}]
[{"$f":"IF('Indirecte werkingskosten'!P31=0, \"Geen vragen of bemerkingen\",'Indirecte werkingskosten'!P31)","v":"Geen vragen of bemerkingen"}]
[]
[{"$f":"'Indirecte werkingskosten'!D32","v":"Kies uit lijst Indirecte Werkingskosten"}]
[]
[{"$f":"IF('Indirecte werkingskosten'!P32=0, \"Geen vragen of bemerkingen\",'Indirecte werkingskosten'!P32)","v":"Geen vragen of bemerkingen"}]
[{"$f":"IF('Indirecte werkingskosten'!P33=0, \"Geen vragen of bemerkingen\",'Indirecte werkingskosten'!P33)","v":"Geen vragen of bemerkingen"}]
[{"$f":"IF('Indirecte werkingskosten'!P34=0, \"Geen vragen of bemerkingen\",'Indirecte werkingskosten'!P34)","v":"Geen vragen of bemerkingen"}]
[{"$f":"IF('Indirecte werkingskosten'!P35=0, \"Geen vragen of bemerkingen\",'Indirecte werkingskosten'!P35)","v":"Geen vragen of bemerkingen"}]
[{"$f":"IF('Indirecte werkingskosten'!P36=0, \"Geen vragen of bemerkingen\",'Indirecte werkingskosten'!P36)","v":"Geen vragen of bemerkingen"}]
[{"$f":"IF('Indirecte werkingskosten'!P37=0, \"Geen vragen of bemerkingen\",'Indirecte werkingskosten'!P37)","v":"Geen vragen of bemerkingen"}]
[{"$f":"IF('Indirecte werkingskosten'!P38=0, \"Geen vragen of bemerkingen\",'Indirecte werkingskosten'!P38)","v":"Geen vragen of bemerkingen"}]
[{"$f":"IF('Indirecte werkingskosten'!P39=0, \"Geen vragen of bemerkingen\",'Indirecte werkingskosten'!P39)","v":"Geen vragen of bemerkingen"}]
[{"$f":"IF('Indirecte werkingskosten'!P40=0, \"Geen vragen of bemerkingen\",'Indirecte werkingskosten'!P40)","v":"Geen vragen of bemerkingen"}]
[{"$f":"IF('Indirecte werkingskosten'!P41=0, \"Geen vragen of bemerkingen\",'Indirecte werkingskosten'!P41)","v":"Geen vragen of bemerkingen"}]
[{"$f":"IF('Indirecte werkingskosten'!P42=0, \"Geen vragen of bemerkingen\",'Indirecte werkingskosten'!P42)","v":"Geen vragen of bemerkingen"}]
[{"$f":"IF('Indirecte werkingskosten'!P43=0, \"Geen vragen of bemerkingen\",'Indirecte werkingskosten'!P43)","v":"Geen vragen of bemerkingen"}]
[{"$f":"IF('Indirecte werkingskosten'!P44=0, \"Geen vragen of bemerkingen\",'Indirecte werkingskosten'!P44)","v":"Geen vragen of bemerkingen"}]
[]
[{"$f":"'Indirecte werkingskosten'!D45","v":"Kies uit lijst Indirecte Werkingskosten"}]
[]
[{"$f":"IF('Indirecte werkingskosten'!P45=0, \"Geen vragen of bemerkingen\",'Indirecte werkingskosten'!P45)","v":"Geen vragen of bemerkingen"}]
[{"$f":"IF('Indirecte werkingskosten'!P46=0, \"Geen vragen of bemerkingen\",'Indirecte werkingskosten'!P46)","v":"Geen vragen of bemerkingen"}]
[{"$f":"IF('Indirecte werkingskosten'!P47=0, \"Geen vragen of bemerkingen\",'Indirecte werkingskosten'!P47)","v":"Geen vragen of bemerkingen"}]
[{"$f":"IF('Indirecte werkingskosten'!P48=0, \"Geen vragen of bemerkingen\",'Indirecte werkingskosten'!P48)","v":"Geen vragen of bemerkingen"}]
[{"$f":"IF('Indirecte werkingskosten'!P49=0, \"Geen vragen of bemerkingen\",'Indirecte werkingskosten'!P49)","v":"Geen vragen of bemerkingen"}]
[{"$f":"IF('Indirecte werkingskosten'!P50=0, \"Geen vragen of bemerkingen\",'Indirecte werkingskosten'!P50)","v":"Geen vragen of bemerkingen"}]
[{"$f":"IF('Indirecte werkingskosten'!P51=0, \"Geen vragen of bemerkingen\",'Indirecte werkingskosten'!P51)","v":"Geen vragen of bemerkingen"}]
[{"$f":"IF('Indirecte werkingskosten'!P52=0, \"Geen vragen of bemerkingen\",'Indirecte werkingskosten'!P52)","v":"Geen vragen of bemerkingen"}]
[{"$f":"IF('Indirecte werkingskosten'!P53=0, \"Geen vragen of bemerkingen\",'Indirecte werkingskosten'!P53)","v":"Geen vragen of bemerkingen"}]
[{"$f":"IF('Indirecte werkingskosten'!P54=0, \"Geen vragen of bemerkingen\",'Indirecte werkingskosten'!P54)","v":"Geen vragen of bemerkingen"}]
[{"$f":"IF('Indirecte werkingskosten'!P55=0, \"Geen vragen of bemerkingen\",'Indirecte werkingskosten'!P55)","v":"Geen vragen of bemerkingen"}]
[{"$f":"IF('Indirecte werkingskosten'!P56=0, \"Geen vragen of bemerkingen\",'Indirecte werkingskosten'!P56)","v":"Geen vragen of bemerkingen"}]
[{"$f":"IF('Indirecte werkingskosten'!P57=0, \"Geen vragen of bemerkingen\",'Indirecte werkingskosten'!P57)","v":"Geen vragen of bemerkingen"}]
[]
[{"$f":"'Indirecte werkingskosten'!D58","v":"Kies uit lijst Indirecte Werkingskosten"}]
[]
[{"$f":"IF('Indirecte werkingskosten'!P58=0, \"Geen vragen of bemerkingen\",'Indirecte werkingskosten'!P58)","v":"Geen vragen of bemerkingen"}]
[{"$f":"IF('Indirecte werkingskosten'!P59=0, \"Geen vragen of bemerkingen\",'Indirecte werkingskosten'!P59)","v":"Geen vragen of bemerkingen"}]
[{"$f":"IF('Indirecte werkingskosten'!P60=0, \"Geen vragen of bemerkingen\",'Indirecte werkingskosten'!P60)","v":"Geen vragen of bemerkingen"}]
[{"$f":"IF('Indirecte werkingskosten'!P61=0, \"Geen vragen of bemerkingen\",'Indirecte werkingskosten'!P61)","v":"Geen vragen of bemerkingen"}]
[{"$f":"IF('Indirecte werkingskosten'!P62=0, \"Geen vragen of bemerkingen\",'Indirecte werkingskosten'!P62)","v":"Geen vragen of bemerkingen"}]
[{"$f":"IF('Indirecte werkingskosten'!P63=0, \"Geen vragen of bemerkingen\",'Indirecte werkingskosten'!P63)","v":"Geen vragen of bemerkingen"}]
[{"$f":"IF('Indirecte werkingskosten'!P64=0, \"Geen vragen of bemerkingen\",'Indirecte werkingskosten'!P64)","v":"Geen vragen of bemerkingen"}]
[{"$f":"IF('Indirecte werkingskosten'!P65=0, \"Geen vragen of bemerkingen\",'Indirecte werkingskosten'!P65)","v":"Geen vragen of bemerkingen"}]
[{"$f":"IF('Indirecte werkingskosten'!P66=0, \"Geen vragen of bemerkingen\",'Indirecte werkingskosten'!P66)","v":"Geen vragen of bemerkingen"}]
[{"$f":"IF('Indirecte werkingskosten'!P67=0, \"Geen vragen of bemerkingen\",'Indirecte werkingskosten'!P67)","v":"Geen vragen of bemerkingen"}]
[{"$f":"IF('Indirecte werkingskosten'!P68=0, \"Geen vragen of bemerkingen\",'Indirecte werkingskosten'!P68)","v":"Geen vragen of bemerkingen"}]
[{"$f":"IF('Indirecte werkingskosten'!P69=0, \"Geen vragen of bemerkingen\",'Indirecte werkingskosten'!P69)","v":"Geen vragen of bemerkingen"}]
[{"$f":"IF('Indirecte werkingskosten'!P70=0, \"Geen vragen of bemerkingen\",'Indirecte werkingskosten'!P70)","v":"Geen vragen of bemerkingen"}]
[]
[{"$f":"'Indirecte werkingskosten'!D71","v":"Kies uit lijst Indirecte Werkingskosten"}]
[]
[{"$f":"IF('Indirecte werkingskosten'!P71=0, \"Geen vragen of bemerkingen\",'Indirecte werkingskosten'!P71)","v":"Geen vragen of bemerkingen"}]
[{"$f":"IF('Indirecte werkingskosten'!P72=0, \"Geen vragen of bemerkingen\",'Indirecte werkingskosten'!P72)","v":"Geen vragen of bemerkingen"}]
[{"$f":"IF('Indirecte werkingskosten'!P73=0, \"Geen vragen of bemerkingen\",'Indirecte werkingskosten'!P73)","v":"Geen vragen of bemerkingen"}]
[{"$f":"IF('Indirecte werkingskosten'!P74=0, \"Geen vragen of bemerkingen\",'Indirecte werkingskosten'!P74)","v":"Geen vragen of bemerkingen"}]
[{"$f":"IF('Indirecte werkingskosten'!P75=0, \"Geen vragen of bemerkingen\",'Indirecte werkingskosten'!P75)","v":"Geen vragen of bemerkingen"}]
[{"$f":"IF('Indirecte werkingskosten'!P76=0, \"Geen vragen of bemerkingen\",'Indirecte werkingskosten'!P76)","v":"Geen vragen of bemerkingen"}]
[{"$f":"IF('Indirecte werkingskosten'!P77=0, \"Geen vragen of bemerkingen\",'Indirecte werkingskosten'!P77)","v":"Geen vragen of bemerkingen"}]
[{"$f":"IF('Indirecte werkingskosten'!P78=0, \"Geen vragen of bemerkingen\",'Indirecte werkingskosten'!P78)","v":"Geen vragen of bemerkingen"}]
[{"$f":"IF('Indirecte werkingskosten'!P79=0, \"Geen vragen of bemerkingen\",'Indirecte werkingskosten'!P79)","v":"Geen vragen of bemerkingen"}]
[{"$f":"IF('Indirecte werkingskosten'!P80=0, \"Geen vragen of bemerkingen\",'Indirecte werkingskosten'!P80)","v":"Geen vragen of bemerkingen"}]
[{"$f":"IF('Indirecte werkingskosten'!P81=0, \"Geen vragen of bemerkingen\",'Indirecte werkingskosten'!P81)","v":"Geen vragen of bemerkingen"}]
[{"$f":"IF('Indirecte werkingskosten'!P82=0, \"Geen vragen of bemerkingen\",'Indirecte werkingskosten'!P82)","v":"Geen vragen of bemerkingen"}]
[{"$f":"IF('Indirecte werkingskosten'!P83=0, \"Geen vragen of bemerkingen\",'Indirecte werkingskosten'!P83)","v":"Geen vragen of bemerkingen"}]
[]
[{"$f":"'Indirecte werkingskosten'!D84","v":"Kies uit lijst Indirecte Werkingskosten"}]
[]
[{"$f":"IF('Indirecte werkingskosten'!P84=0, \"Geen vragen of bemerkingen\",'Indirecte werkingskosten'!P84)","v":"Geen vragen of bemerkingen"}]
[{"$f":"IF('Indirecte werkingskosten'!P85=0, \"Geen vragen of bemerkingen\",'Indirecte werkingskosten'!P85)","v":"Geen vragen of bemerkingen"}]
[{"$f":"IF('Indirecte werkingskosten'!P86=0, \"Geen vragen of bemerkingen\",'Indirecte werkingskosten'!P86)","v":"Geen vragen of bemerkingen"}]
[{"$f":"IF('Indirecte werkingskosten'!P87=0, \"Geen vragen of bemerkingen\",'Indirecte werkingskosten'!P87)","v":"Geen vragen of bemerkingen"}]
[{"$f":"IF('Indirecte werkingskosten'!P88=0, \"Geen vragen of bemerkingen\",'Indirecte werkingskosten'!P88)","v":"Geen vragen of bemerkingen"}]
[{"$f":"IF('Indirecte werkingskosten'!P89=0, \"Geen vragen of bemerkingen\",'Indirecte werkingskosten'!P89)","v":"Geen vragen of bemerkingen"}]
[]
[{"$f":"IF('Indirecte werkingskosten'!P90=0, \"Geen vragen of bemerkingen\",'Indirecte werkingskosten'!P90)","v":"Geen vragen of bemerkingen"}]
[{"$f":"IF('Indirecte werkingskosten'!P91=0, \"Geen vragen of bemerkingen\",'Indirecte werkingskosten'!P91)","v":"Geen vragen of bemerkingen"}]
[{"$f":"IF('Indirecte werkingskosten'!P92=0, \"Geen vragen of bemerkingen\",'Indirecte werkingskosten'!P92)","v":"Geen vragen of bemerkingen"}]
[{"$f":"IF('Indirecte werkingskosten'!P93=0, \"Geen vragen of bemerkingen\",'Indirecte werkingskosten'!P93)","v":"Geen vragen of bemerkingen"}]
[{"$f":"IF('Indirecte werkingskosten'!P94=0, \"Geen vragen of bemerkingen\",'Indirecte werkingskosten'!P94)","v":"Geen vragen of bemerkingen"}]
[{"$f":"IF('Indirecte werkingskosten'!P95=0, \"Geen vragen of bemerkingen\",'Indirecte werkingskosten'!P95)","v":"Geen vragen of bemerkingen"}]
[{"$f":"IF('Indirecte werkingskosten'!P96=0, \"Geen vragen of bemerkingen\",'Indirecte werkingskosten'!P96)","v":"Geen vragen of bemerkingen"}]
[]
[{"$f":"'Indirecte werkingskosten'!D97","v":"Kies uit lijst Indirecte Werkingskosten"}]
[]
[{"$f":"IF('Indirecte werkingskosten'!P97=0, \"Geen vragen of bemerkingen\",'Indirecte werkingskosten'!P97)","v":"Geen vragen of bemerkingen"}]
[{"$f":"IF('Indirecte werkingskosten'!P98=0, \"Geen vragen of bemerkingen\",'Indirecte werkingskosten'!P98)","v":"Geen vragen of bemerkingen"}]
[{"$f":"IF('Indirecte werkingskosten'!P99=0, \"Geen vragen of bemerkingen\",'Indirecte werkingskosten'!P99)","v":"Geen vragen of bemerkingen"}]
[{"$f":"IF('Indirecte werkingskosten'!P100=0, \"Geen vragen of bemerkingen\",'Indirecte werkingskosten'!P100)","v":"Geen vragen of bemerkingen"}]
[{"$f":"IF('Indirecte werkingskosten'!P101=0, \"Geen vragen of bemerkingen\",'Indirecte werkingskosten'!P101)","v":"Geen vragen of bemerkingen"}]
[{"$f":"IF('Indirecte werkingskosten'!P102=0, \"Geen vragen of bemerkingen\",'Indirecte werkingskosten'!P102)","v":"Geen vragen of bemerkingen"}]
[{"$f":"IF('Indirecte werkingskosten'!P103=0, \"Geen vragen of bemerkingen\",'Indirecte werkingskosten'!P103)","v":"Geen vragen of bemerkingen"}]
[{"$f":"IF('Indirecte werkingskosten'!P104=0, \"Geen vragen of bemerkingen\",'Indirecte werkingskosten'!P104)","v":"Geen vragen of bemerkingen"}]
[{"$f":"IF('Indirecte werkingskosten'!P105=0, \"Geen vragen of bemerkingen\",'Indirecte werkingskosten'!P105)","v":"Geen vragen of bemerkingen"}]
[{"$f":"IF('Indirecte werkingskosten'!P106=0, \"Geen vragen of bemerkingen\",'Indirecte werkingskosten'!P106)","v":"Geen vragen of bemerkingen"}]
[{"$f":"IF('Indirecte werkingskosten'!P107=0, \"Geen vragen of bemerkingen\",'Indirecte werkingskosten'!P107)","v":"Geen vragen of bemerkingen"}]
[{"$f":"IF('Indirecte werkingskosten'!P108=0, \"Geen vragen of bemerkingen\",'Indirecte werkingskosten'!P108)","v":"Geen vragen of bemerkingen"}]
[{"$f":"IF('Indirecte werkingskosten'!P109=0, \"Geen vragen of bemerkingen\",'Indirecte werkingskosten'!P109)","v":"Geen vragen of bemerkingen"}]
[]
[{"$f":"'Indirecte werkingskosten'!D110","v":"Kies uit lijst Indirecte Werkingskosten"}]
[]
[{"$f":"IF('Indirecte werkingskosten'!P110=0, \"Geen vragen of bemerkingen\",'Indirecte werkingskosten'!P110)","v":"Geen vragen of bemerkingen"}]
[{"$f":"IF('Indirecte werkingskosten'!P111=0, \"Geen vragen of bemerkingen\",'Indirecte werkingskosten'!P111)","v":"Geen vragen of bemerkingen"}]
[{"$f":"IF('Indirecte werkingskosten'!P112=0, \"Geen vragen of bemerkingen\",'Indirecte werkingskosten'!P112)","v":"Geen vragen of bemerkingen"}]
[{"$f":"IF('Indirecte werkingskosten'!P113=0, \"Geen vragen of bemerkingen\",'Indirecte werkingskosten'!P113)","v":"Geen vragen of bemerkingen"}]
[{"$f":"IF('Indirecte werkingskosten'!P114=0, \"Geen vragen of bemerkingen\",'Indirecte werkingskosten'!P114)","v":"Geen vragen of bemerkingen"}]
[{"$f":"IF('Indirecte werkingskosten'!P115=0, \"Geen vragen of bemerkingen\",'Indirecte werkingskosten'!P115)","v":"Geen vragen of bemerkingen"}]
[{"$f":"IF('Indirecte werkingskosten'!P116=0, \"Geen vragen of bemerkingen\",'Indirecte werkingskosten'!P116)","v":"Geen vragen of bemerkingen"}]
[{"$f":"IF('Indirecte werkingskosten'!P117=0, \"Geen vragen of bemerkingen\",'Indirecte werkingskosten'!P117)","v":"Geen vragen of bemerkingen"}]
[{"$f":"IF('Indirecte werkingskosten'!P118=0, \"Geen vragen of bemerkingen\",'Indirecte werkingskosten'!P118)","v":"Geen vragen of bemerkingen"}]
[{"$f":"IF('Indirecte werkingskosten'!P119=0, \"Geen vragen of bemerkingen\",'Indirecte werkingskosten'!P119)","v":"Geen vragen of bemerkingen"}]
[{"$f":"IF('Indirecte werkingskosten'!P120=0, \"Geen vragen of bemerkingen\",'Indirecte werkingskosten'!P120)","v":"Geen vragen of bemerkingen"}]
[{"$f":"IF('Indirecte werkingskosten'!P121=0, \"Geen vragen of bemerkingen\",'Indirecte werkingskosten'!P121)","v":"Geen vragen of bemerkingen"}]
[{"$f":"IF('Indirecte werkingskosten'!P122=0, \"Geen vragen of bemerkingen\",'Indirecte werkingskosten'!P122)","v":"Geen vragen of bemerkingen"}]
[]
[{"$f":"'Indirecte werkingskosten'!D123","v":"Kies uit lijst Indirecte Werkingskosten"}]
[]
[{"$f":"IF('Indirecte werkingskosten'!P123=0, \"Geen vragen of bemerkingen\",'Indirecte werkingskosten'!P123)","v":"Geen vragen of bemerkingen"}]
[{"$f":"IF('Indirecte werkingskosten'!P124=0, \"Geen vragen of bemerkingen\",'Indirecte werkingskosten'!P124)","v":"Geen vragen of bemerkingen"}]
[{"$f":"IF('Indirecte werkingskosten'!P125=0, \"Geen vragen of bemerkingen\",'Indirecte werkingskosten'!P125)","v":"Geen vragen of bemerkingen"}]
[{"$f":"IF('Indirecte werkingskosten'!P126=0, \"Geen vragen of bemerkingen\",'Indirecte werkingskosten'!P126)","v":"Geen vragen of bemerkingen"}]
[{"$f":"IF('Indirecte werkingskosten'!P127=0, \"Geen vragen of bemerkingen\",'Indirecte werkingskosten'!P127)","v":"Geen vragen of bemerkingen"}]
[{"$f":"IF('Indirecte werkingskosten'!P128=0, \"Geen vragen of bemerkingen\",'Indirecte werkingskosten'!P128)","v":"Geen vragen of bemerkingen"}]
[{"$f":"IF('Indirecte werkingskosten'!P129=0, \"Geen vragen of bemerkingen\",'Indirecte werkingskosten'!P129)","v":"Geen vragen of bemerkingen"}]
[{"$f":"IF('Indirecte werkingskosten'!P130=0, \"Geen vragen of bemerkingen\",'Indirecte werkingskosten'!P130)","v":"Geen vragen of bemerkingen"}]
[{"$f":"IF('Indirecte werkingskosten'!P131=0, \"Geen vragen of bemerkingen\",'Indirecte werkingskosten'!P131)","v":"Geen vragen of bemerkingen"}]
[{"$f":"IF('Indirecte werkingskosten'!P132=0, \"Geen vragen of bemerkingen\",'Indirecte werkingskosten'!P132)","v":"Geen vragen of bemerkingen"}]
[{"$f":"IF('Indirecte werkingskosten'!P133=0, \"Geen vragen of bemerkingen\",'Indirecte werkingskosten'!P133)","v":"Geen vragen of bemerkingen"}]
[{"$f":"IF('Indirecte werkingskosten'!P134=0, \"Geen vragen of bemerkingen\",'Indirecte werkingskosten'!P134)","v":"Geen vragen of bemerkingen"}]
[{"$f":"IF('Indirecte werkingskosten'!P135=0, \"Geen vragen of bemerkingen\",'Indirecte werkingskosten'!P135)","v":"Geen vragen of bemerkingen"}]
[]
[{"$f":"'Indirecte werkingskosten'!D136","v":"Andere: (zelf in te vullen)"}]
[]
[{"$f":"IF('Indirecte werkingskosten'!P136=0, \"Geen vragen of bemerkingen\",'Indirecte werkingskosten'!P136)","v":"Geen vragen of bemerkingen"}]
[{"$f":"IF('Indirecte werkingskosten'!P137=0, \"Geen vragen of bemerkingen\",'Indirecte werkingskosten'!P137)","v":"Geen vragen of bemerkingen"}]
[{"$f":"IF('Indirecte werkingskosten'!P138=0, \"Geen vragen of bemerkingen\",'Indirecte werkingskosten'!P138)","v":"Geen vragen of bemerkingen"}]
[{"$f":"IF('Indirecte werkingskosten'!P139=0, \"Geen vragen of bemerkingen\",'Indirecte werkingskosten'!P139)","v":"Geen vragen of bemerkingen"}]
[{"$f":"IF('Indirecte werkingskosten'!P140=0, \"Geen vragen of bemerkingen\",'Indirecte werkingskosten'!P140)","v":"Geen vragen of bemerkingen"}]
[{"$f":"IF('Indirecte werkingskosten'!P141=0, \"Geen vragen of bemerkingen\",'Indirecte werkingskosten'!P141)","v":"Geen vragen of bemerkingen"}]
[{"$f":"IF('Indirecte werkingskosten'!P142=0, \"Geen vragen of bemerkingen\",'Indirecte werkingskosten'!P142)","v":"Geen vragen of bemerkingen"}]
[{"$f":"IF('Indirecte werkingskosten'!P143=0, \"Geen vragen of bemerkingen\",'Indirecte werkingskosten'!P143)","v":"Geen vragen of bemerkingen"}]
[{"$f":"IF('Indirecte werkingskosten'!P144=0, \"Geen vragen of bemerkingen\",'Indirecte werkingskosten'!P144)","v":"Geen vragen of bemerkingen"}]
[{"$f":"IF('Indirecte werkingskosten'!P145=0, \"Geen vragen of bemerkingen\",'Indirecte werkingskosten'!P145)","v":"Geen vragen of bemerkingen"}]
[{"$f":"IF('Indirecte werkingskosten'!P146=0, \"Geen vragen of bemerkingen\",'Indirecte werkingskosten'!P146)","v":"Geen vragen of bemerkingen"}]
[{"$f":"IF('Indirecte werkingskosten'!P147=0, \"Geen vragen of bemerkingen\",'Indirecte werkingskosten'!P147)","v":"Geen vragen of bemerkingen"}]
[{"$f":"IF('Indirecte werkingskosten'!P148=0, \"Geen vragen of bemerkingen\",'Indirecte werkingskosten'!P148)","v":"Geen vragen of bemerkingen"}]
[]
[{"$f":"'Indirecte werkingskosten'!D149","v":"Andere: (zelf in te vullen)"}]
[]
[{"$f":"IF('Indirecte werkingskosten'!P149=0, \"Geen vragen of bemerkingen\",'Indirecte werkingskosten'!P149)","v":"Geen vragen of bemerkingen"}]
[{"$f":"IF('Indirecte werkingskosten'!P150=0, \"Geen vragen of bemerkingen\",'Indirecte werkingskosten'!P150)","v":"Geen vragen of bemerkingen"}]
[{"$f":"IF('Indirecte werkingskosten'!P151=0, \"Geen vragen of bemerkingen\",'Indirecte werkingskosten'!P151)","v":"Geen vragen of bemerkingen"}]
[{"$f":"IF('Indirecte werkingskosten'!P152=0, \"Geen vragen of bemerkingen\",'Indirecte werkingskosten'!P152)","v":"Geen vragen of bemerkingen"}]
[{"$f":"IF('Indirecte werkingskosten'!P153=0, \"Geen vragen of bemerkingen\",'Indirecte werkingskosten'!P153)","v":"Geen vragen of bemerkingen"}]
[{"$f":"IF('Indirecte werkingskosten'!P154=0, \"Geen vragen of bemerkingen\",'Indirecte werkingskosten'!P154)","v":"Geen vragen of bemerkingen"}]
[{"$f":"IF('Indirecte werkingskosten'!P155=0, \"Geen vragen of bemerkingen\",'Indirecte werkingskosten'!P155)","v":"Geen vragen of bemerkingen"}]
[{"$f":"IF('Indirecte werkingskosten'!P156=0, \"Geen vragen of bemerkingen\",'Indirecte werkingskosten'!P156)","v":"Geen vragen of bemerkingen"}]
[{"$f":"IF('Indirecte werkingskosten'!P157=0, \"Geen vragen of bemerkingen\",'Indirecte werkingskosten'!P157)","v":"Geen vragen of bemerkingen"}]
[{"$f":"IF('Indirecte werkingskosten'!P158=0, \"Geen vragen of bemerkingen\",'Indirecte werkingskosten'!P158)","v":"Geen vragen of bemerkingen"}]
[{"$f":"IF('Indirecte werkingskosten'!P159=0, \"Geen vragen of bemerkingen\",'Indirecte werkingskosten'!P159)","v":"Geen vragen of bemerkingen"}]
[{"$f":"IF('Indirecte werkingskosten'!P160=0, \"Geen vragen of bemerkingen\",'Indirecte werkingskosten'!P160)","v":"Geen vragen of bemerkingen"}]
[{"$f":"IF('Indirecte werkingskosten'!P161=0, \"Geen vragen of bemerkingen\",'Indirecte werkingskosten'!P161)","v":"Geen vragen of bemerkingen"}]
[{"$f":"IF('Indirecte werkingskosten'!P162=0, \"Geen vragen of bemerkingen\",'Indirecte werkingskosten'!P162)","v":"Geen vragen of bemerkingen"}]
[]
[]
["Gelieve een antwoord te bezorgen, aub:",null,null,null,"van zodra mogelijk "]

{"sheet":"Antwoorden op FIN vragen","index":17,"n_rows":1002,"n_cols":3,"rows_kept":1002,"cut":false,"hidden":true,"merged":[[1001,0,1001,8],[968,0,968,8],[970,0,970,8],[975,0,975,8],[977,0,977,8],[979,0,979,8],[981,0,981,8],[983,0,983,8],[985,0,985,8],[987,0,987,8],[996,0,996,8],[998,0,998,8],[1000,0,1000,8],[989,0,989,8],[991,0,991,8],[993,0,993,8],[995,0,995,8],[997,0,997,8],[999,0,999,8],[962,0,962,8],[964,0,964,8],[966,0,966,8],[917,0,917,8],[919,0,919,8],[921,0,921,8],[923,0,923,8],[925,0,925,8],[927,0,927,8],[929,0,929,8],[931,0,931,8],[933,0,933,8],[918,0,918,8],[920,0,920,8],[922,0,922,8],[924,0,924,8],[926,0,926,8],[928,0,928,8],[930,0,930,8],[932,0,932,8],[934,0,934,8],[936,0,936,8],[938,0,938,8],[940,0,940,8],[890,0,890,8],[892,0,892,8],[894,0,894,8],[896,0,896,8],[898,0,898,8],[900,0,900,8],[902,0,902,8],[904,0,904,8],[906,0,906,8],[903,0,903,8],[905,0,905,8],[863,0,863,8],[865,0,865,8],[867,0,867,8],[869,0,869,8],[871,0,871,8],[873,0,873,8],[875,0,875,8],[877,0,877,8],[879,0,879,8],[876,0,876,8],[878,0,878,8],[836,0,836,8],[838,0,838,8],[840,0,840,8],[842,0,842,8],[844,0,844,8],[846,0,846,8],[848,0,848,8],[850,0,850,8],[852,0,852,8],[849,0,849,8],[851,0,851,8],[809,0,809,8],[811,0,811,8],[813,0,813,8],[815,0,815,8],[817,0,817,8],[819,0,819,8],[821,0,821,8],[823,0,823,8],[825,0,825,8],[822,0,822,8],[824,0,824,8],[782,0,782,8],[784,0,784,8],[786,0,786,8],[788,0,788,8],[790,0,790,8],[792,0,792,8],[794,0,794,8],[796,0,796,8],[801,0,801,8],[795,0,795,8],[800,0,800,8],[755,0,755,8],[757,0,757,8],[759,0,759,8],[761,0,761,8],[763,0,763,8],[765,0,765,8],[767,0,767,8],[772,0,772,8],[774,0,774,8],[771,0,771,8],[773,0,773,8],[728,0,728,8],[730,0,730,8],[732,0,732,8],[734,0,734,8],[736,0,736,8],[738,0,738,8],[743,0,743,8],[745,0,745,8],[747,0,747,8],[744,0,744,8],[746,0,746,8],[701,0,701,8],[703,0,703,8],[705,0,705,8],[707,0,707,8],[709,0,709,8],[714,0,714,8],[716,0,716,8],[718,0,718,8],[720,0,720,8],[717,0,717,8],[719,0,719,8],[674,0,674,8],[676,0,676,8],[678,0,678,8],[680,0,680,8],[685,0,685,8],[687,0,687,8],[689,0,689,8],[691,0,691,8],[693,0,693,8],[690,0,690,8],[692,0,692,8],[645,0,645,8],[647,0,647,8],[649,0,649,8],[656,0,656,8],[658,0,658,8],[660,0,660,8],[662,0,662,8],[664,0,664,8],[666,0,666,8],[663,0,663,8],[665,0,665,8],[618,0,618,8],[623,0,623,8],[625,0,625,8],[627,0,627,8],[629,0,629,8],[631,0,631,8],[633,0,633,8],[635,0,635,8],[637,0,637,8],[634,0,634,8],[636,0,636,8],[594,0,594,8],[596,0,596,8],[598,0,598,8],[600,0,600,8],[602,0,602,8],[604,0,604,8],[606,0,606,8],[608,0,608,8],[610,0,610,8],[607,0,607,8],[609,0,609,8],[567,0,567,8],[569,0,569,8],[571,0,571,8],[573,0,573,8],[575,0,575,8],[577,0,577,8],[579,0,579,8],[581,0,581,8],[583,0,583,8],[580,0,580,8],[582,0,582,8],[540,0,540,8],[542,0,542,8],[544,0,544,8],[546,0,546,8],[548,0,548,8],[550,0,550,8],[552,0,552,8],[554,0,554,8],[556,0,556,8],[553,0,553,8],[555,0,555,8],[513,0,513,8],[515,0,515,8],[517,0,517,8],[519,0,519,8],[521,0,521,8],[523,0,523,8],[525,0,525,8],[527,0,527,8],[529,0,529,8],[526,0,526,8],[528,0,528,8],[486,0,486,8],[488,0,488,8],[490,0,490,8],[492,0,492,8],[494,0,494,8],[496,0,496,8],[498,0,498,8],[500,0,500,8],[502,0,502,8],[499,0,499,8],[501,0,501,8],[459,0,459,8],[461,0,461,8],[463,0,463,8],[465,0,465,8],[467,0,467,8],[469,0,469,8],[471,0,471,8],[473,0,473,8],[478,0,478,8],[472,0,472,8],[477,0,477,8],[1004,4,1004,8],[9,0,9,8],[11,0,11,8],[13,0,13,8],[21,0,21,8],[29,0,29,8],[984,0,984,8],[986,0,986,8],[988,0,988,8],[990,0,990,8],[992,0,992,8],[994,0,994,8],[969,0,969,8],[974,0,974,8],[976,0,976,8],[978,0,978,8],[980,0,980,8],[982,0,982,8],[957,0,957,8],[959,0,959,8],[961,0,961,8],[963,0,963,8],[965,0,965,8],[967,0,967,8],[935,0,935,8],[937,0,937,8],[939,0,939,8],[941,0,941,8],[946,0,946,8],[948,0,948,8],[950,0,950,8],[952,0,952,8],[954,0,954,8],[956,0,956,8],[958,0,958,8],[960,0,960,8],[945,0,945,8],[947,0,947,8],[949,0,949,8],[951,0,951,8],[953,0,953,8],[955,0,955,8],[907,0,907,8],[909,0,909,8],[911,0,911,8],[916,0,916,8],[891,0,891,8],[893,0,893,8],[895,0,895,8],[897,0,897,8],[899,0,899,8],[901,0,901,8],[908,0,908,8],[910,0,910,8],[912,0,912,8],[880,0,880,8],[882,0,882,8],[887,0,887,8],[889,0,889,8],[864,0,864,8],[866,0,866,8],[868,0,868,8],[870,0,870,8],[872,0,872,8],[874,0,874,8],[881,0,881,8],[883,0,883,8],[888,0,888,8],[853,0,853,8],[858,0,858,8],[860,0,860,8],[862,0,862,8],[837,0,837,8],[839,0,839,8],[841,0,841,8],[843,0,843,8],[845,0,845,8],[847,0,847,8],[854,0,854,8],[859,0,859,8],[861,0,861,8],[829,0,829,8],[831,0,831,8],[833,0,833,8],[835,0,835,8],[810,0,810,8],[812,0,812,8],[814,0,814,8],[816,0,816,8],[818,0,818,8],[820,0,820,8],[830,0,830,8],[832,0,832,8],[834,0,834,8],[802,0,802,8],[804,0,804,8],[806,0,806,8],[808,0,808,8],[783,0,783,8],[785,0,785,8],[787,0,787,8],[789,0,789,8],[791,0,791,8],[793,0,793,8],[803,0,803,8],[805,0,805,8],[807,0,807,8],[775,0,775,8],[777,0,777,8],[779,0,779,8],[781,0,781,8],[756,0,756,8],[758,0,758,8],[760,0,760,8],[762,0,762,8],[764,0,764,8],[766,0,766,8],[776,0,776,8],[778,0,778,8],[780,0,780,8],[748,0,748,8],[750,0,750,8],[752,0,752,8],[754,0,754,8],[729,0,729,8],[731,0,731,8],[733,0,733,8],[735,0,735,8],[737,0,737,8],[742,0,742,8],[749,0,749,8],[751,0,751,8],[753,0,753,8],[721,0,721,8],[723,0,723,8],[725,0,725,8],[727,0,727,8],[702,0,702,8],[704,0,704,8],[706,0,706,8],[708,0,708,8],[713,0,713,8],[715,0,715,8],[722,0,722,8],[724,0,724,8],[726,0,726,8],[694,0,694,8],[696,0,696,8],[698,0,698,8],[700,0,700,8],[675,0,675,8],[677,0,677,8],[679,0,679,8],[684,0,684,8],[686,0,686,8],[688,0,688,8],[695,0,695,8],[697,0,697,8],[699,0,699,8],[667,0,667,8],[669,0,669,8],[671,0,671,8],[673,0,673,8],[646,0,646,8],[648,0,648,8],[655,0,655,8],[657,0,657,8],[659,0,659,8],[661,0,661,8],[668,0,668,8],[670,0,670,8],[672,0,672,8],[638,0,638,8],[640,0,640,8],[642,0,642,8],[644,0,644,8],[622,0,622,8],[624,0,624,8],[626,0,626,8],[628,0,628,8],[630,0,630,8],[632,0,632,8],[639,0,639,8],[641,0,641,8],[643,0,643,8],[611,0,611,8],[613,0,613,8],[615,0,615,8],[617,0,617,8],[595,0,595,8],[597,0,597,8],[599,0,599,8],[601,0,601,8],[603,0,603,8],[605,0,605,8],[612,0,612,8],[614,0,614,8],[616,0,616,8],[584,0,584,8],[586,0,586,8],[588,0,588,8],[593,0,593,8],[568,0,568,8],[570,0,570,8],[572,0,572,8],[574,0,574,8],[576,0,576,8],[578,0,578,8],[585,0,585,8],[587,0,587,8],[589,0,589,8],[557,0,557,8],[559,0,559,8],[564,0,564,8],[566,0,566,8],[541,0,541,8],[543,0,543,8],[545,0,545,8],[547,0,547,8],[549,0,549,8],[551,0,551,8],[558,0,558,8],[560,0,560,8],[565,0,565,8],[530,0,530,8],[535,0,535,8],[537,0,537,8],[539,0,539,8],[514,0,514,8],[516,0,516,8],[518,0,518,8],[520,0,520,8],[522,0,522,8],[524,0,524,8],[531,0,531,8],[536,0,536,8],[538,0,538,8],[506,0,506,8],[508,0,508,8],[510,0,510,8],[512,0,512,8],[487,0,487,8],[489,0,489,8],[491,0,491,8],[493,0,493,8],[495,0,495,8],[497,0,497,8],[507,0,507,8],[509,0,509,8],[511,0,511,8],[479,0,479,8],[481,0,481,8],[483,0,483,8],[485,0,485,8],[460,0,460,8],[462,0,462,8],[464,0,464,8],[466,0,466,8],[468,0,468,8],[470,0,470,8],[480,0,480,8],[482,0,482,8],[484,0,484,8],[425,0,425,8],[427,0,427,8],[429,0,429,8],[431,0,431,8],[452,0,452,8],[454,0,454,8],[456,0,456,8],[458,0,458,8],[433,0,433,8],[435,0,435,8],[437,0,437,8],[439,0,439,8],[441,0,441,8],[443,0,443,8],[449,0,449,8],[451,0,451,8],[453,0,453,8],[455,0,455,8],[457,0,457,8],[426,0,426,8],[428,0,428,8],[430,0,430,8],[448,0,448,8],[450,0,450,8],[432,0,432,8],[434,0,434,8],[436,0,436,8],[438,0,438,8],[440,0,440,8],[442,0,442,8],[444,0,444,8],[398,0,398,8],[400,0,400,8],[402,0,402,8],[404,0,404,8],[405,0,405,8],[407,0,407,8],[409,0,409,8],[411,0,411,8],[413,0,413,8],[415,0,415,8],[420,0,420,8],[422,0,422,8],[424,0,424,8],[421,0,421,8],[423,0,423,8],[406,0,406,8],[408,0,408,8],[371,0,371,8],[373,0,373,8],[375,0,375,8],[377,0,377,8],[352,0,352,8],[354,0,354,8],[356,0,356,8],[361,0,361,8],[363,0,363,8],[365,0,365,8],[372,0,372,8],[374,0,374,8],[376,0,376,8],[344,0,344,8],[346,0,346,8],[348,0,348,8],[350,0,350,8],[323,0,323,8],[325,0,325,8],[332,0,332,8],[334,0,334,8],[336,0,336,8],[338,0,338,8],[345,0,345,8],[347,0,347,8],[349,0,349,8],[312,0,312,8],[317,0,317,8],[319,0,319,8],[321,0,321,8],[296,0,296,8],[298,0,298,8],[300,0,300,8],[302,0,302,8],[304,0,304,8],[306,0,306,8],[313,0,313,8],[318,0,318,8],[320,0,320,8],[288,0,288,8],[290,0,290,8],[292,0,292,8],[294,0,294,8],[269,0,269,8],[271,0,271,8],[273,0,273,8],[275,0,275,8],[277,0,277,8],[279,0,279,8],[289,0,289,8],[291,0,291,8],[293,0,293,8],[263,0,263,8],[265,0,265,8],[267,0,267,8],[246,0,246,8],[248,0,248,8],[250,0,250,8],[252,0,252,8],[254,0,254,8],[256,0,256,8],[264,0,264,8],[266,0,266,8],[240,0,240,8],[242,0,242,8],[244,0,244,8],[223,0,223,8],[225,0,225,8],[226,0,226,8],[228,0,228,8],[230,0,230,8],[232,0,232,8],[241,0,241,8],[243,0,243,8],[215,0,215,8],[217,0,217,8],[219,0,219,8],[221,0,221,8],[199,0,199,8],[201,0,201,8],[203,0,203,8],[205,0,205,8],[207,0,207,8],[209,0,209,8],[216,0,216,8],[218,0,218,8],[220,0,220,8],[193,0,193,8],[195,0,195,8],[197,0,197,8],[176,0,176,8],[178,0,178,8],[180,0,180,8],[181,0,181,8],[183,0,183,8],[185,0,185,8],[194,0,194,8],[196,0,196,8],[170,0,170,8],[172,0,172,8],[174,0,174,8],[153,0,153,8],[155,0,155,8],[157,0,157,8],[159,0,159,8],[160,0,160,8],[162,0,162,8],[171,0,171,8],[173,0,173,8],[145,0,145,8],[147,0,147,8],[149,0,149,8],[151,0,151,8],[129,0,129,8],[131,0,131,8],[133,0,133,8],[135,0,135,8],[137,0,137,8],[139,0,139,8],[146,0,146,8],[148,0,148,8],[150,0,150,8],[122,0,122,8],[124,0,124,8],[126,0,126,8],[127,0,127,8],[106,0,106,8],[108,0,108,8],[110,0,110,8],[112,0,112,8],[114,0,114,8],[116,0,116,8],[123,0,123,8],[125,0,125,8],[100,0,100,8],[102,0,102,8],[104,0,104,8],[83,0,83,8],[85,0,85,8],[87,0,87,8],[89,0,89,8],[91,0,91,8],[93,0,93,8],[101,0,101,8],[103,0,103,8],[77,0,77,8],[79,0,79,8],[81,0,81,8],[60,0,60,8],[61,0,61,8],[63,0,63,8],[65,0,65,8],[67,0,67,8],[69,0,69,8],[78,0,78,8],[80,0,80,8],[48,0,48,8],[50,0,50,8],[52,0,52,8],[54,0,54,8],[56,0,56,8],[58,0,58,8],[36,0,36,8],[38,0,38,8],[40,0,40,8],[42,0,42,8],[44,0,44,8],[46,0,46,8],[41,0,41,8],[43,0,43,8],[45,0,45,8],[47,0,47,8],[49,0,49,8],[51,0,51,8],[53,0,53,8],[55,0,55,8],[57,0,57,8],[2,0,2,1],[2,2,2,8],[3,0,4,8],[8,0,8,8],[10,0,10,8],[12,0,12,8],[35,0,35,8],[37,0,37,8],[39,0,39,8],[20,0,20,8],[27,0,27,8],[28,0,28,8],[30,0,30,8],[32,0,32,8],[34,0,34,8],[31,0,31,8],[33,0,33,8],[14,0,14,8],[15,0,15,8],[16,0,16,8],[17,0,17,8],[18,0,18,8],[19,0,19,8],[59,0,59,8],[62,0,62,8],[64,0,64,8],[66,0,66,8],[68,0,68,8],[70,0,70,8],[72,0,72,8],[74,0,74,8],[76,0,76,8],[71,0,71,8],[73,0,73,8],[75,0,75,8],[82,0,82,8],[84,0,84,8],[86,0,86,8],[88,0,88,8],[90,0,90,8],[92,0,92,8],[95,0,95,8],[97,0,97,8],[99,0,99,8],[94,0,94,8],[96,0,96,8],[98,0,98,8],[105,0,105,8],[107,0,107,8],[109,0,109,8],[111,0,111,8],[113,0,113,8],[115,0,115,8],[117,0,117,8],[119,0,119,8],[121,0,121,8],[118,0,118,8],[120,0,120,8],[128,0,128,8],[130,0,130,8],[132,0,132,8],[134,0,134,8],[136,0,136,8],[138,0,138,8],[140,0,140,8],[142,0,142,8],[144,0,144,8],[141,0,141,8],[143,0,143,8],[152,0,152,8],[154,0,154,8],[156,0,156,8],[158,0,158,8],[161,0,161,8],[163,0,163,8],[165,0,165,8],[167,0,167,8],[169,0,169,8],[164,0,164,8],[166,0,166,8],[168,0,168,8],[175,0,175,8],[177,0,177,8],[179,0,179,8],[182,0,182,8],[184,0,184,8],[186,0,186,8],[188,0,188,8],[190,0,190,8],[192,0,192,8],[187,0,187,8],[189,0,189,8],[191,0,191,8],[198,0,198,8],[200,0,200,8],[202,0,202,8],[204,0,204,8],[206,0,206,8],[208,0,208,8],[210,0,210,8],[212,0,212,8],[214,0,214,8],[211,0,211,8],[213,0,213,8],[222,0,222,8],[224,0,224,8],[227,0,227,8],[229,0,229,8],[231,0,231,8],[233,0,233,8],[235,0,235,8],[237,0,237,8],[239,0,239,8],[234,0,234,8],[236,0,236,8],[238,0,238,8],[245,0,245,8],[247,0,247,8],[249,0,249,8],[251,0,251,8],[253,0,253,8],[255,0,255,8],[258,0,258,8],[260,0,260,8],[262,0,262,8],[257,0,257,8],[259,0,259,8],[261,0,261,8],[268,0,268,8],[270,0,270,8],[272,0,272,8],[274,0,274,8],[276,0,276,8],[278,0,278,8],[280,0,280,8],[282,0,282,8],[284,0,284,8],[281,0,281,8],[283,0,283,8],[295,0,295,8],[297,0,297,8],[299,0,299,8],[301,0,301,8],[303,0,303,8],[305,0,305,8],[307,0,307,8],[309,0,309,8],[311,0,311,8],[308,0,308,8],[310,0,310,8],[322,0,322,8],[324,0,324,8],[326,0,326,8],[333,0,333,8],[335,0,335,8],[337,0,337,8],[339,0,339,8],[341,0,341,8],[343,0,343,8],[340,0,340,8],[342,0,342,8],[351,0,351,8],[353,0,353,8],[355,0,355,8],[357,0,357,8],[362,0,362,8],[364,0,364,8],[366,0,366,8],[368,0,368,8],[370,0,370,8],[367,0,367,8],[369,0,369,8],[410,0,410,8],[412,0,412,8],[414,0,414,8],[419,0,419,8],[378,0,378,8],[380,0,380,8],[382,0,382,8],[384,0,384,8],[386,0,386,8],[391,0,391,8],[393,0,393,8],[395,0,395,8],[397,0,397,8],[394,0,394,8],[396,0,396,8],[379,0,379,8],[381,0,381,8],[383,0,383,8],[385,0,385,8],[390,0,390,8],[392,0,392,8],[399,0,399,8],[401,0,401,8],[403,0,403,8]]}
[]
[]
[{"$f":"'Bijkomende vragen Fin Verslag'!A3","v":"2021/XX"},null,{"$f":"'Bijkomende vragen Fin Verslag'!C3","v":0}]
["Antwoorden op de bijkomende vragen omtrent financieel (eind)rapport "]
[]
[]
["ALGEMENE VRAGEN  "]
[]
["A.1. Gelieve XX, aub. "]
["Gelieve hier te antwoorden of naam bijlage te vermelden en het vak naar lengte van het antwoord te vergroten  aub"]
["A.2. Gelieve XX, aub. "]
["Gelieve hier te antwoorden of naam bijlage te vermelden en het vak naar lengte van het antwoord te vergroten  aub"]
["A.3. Gelieve XX, aub. "]
["Gelieve hier te antwoorden of naam bijlage te vermelden en het vak naar lengte van het antwoord te vergroten  aub"]
["A.4. Gelieve XX, aub. "]
["Gelieve hier te antwoorden of naam bijlage te vermelden en het vak naar lengte van het antwoord te vergroten  aub"]
["A.6. Gelieve XX, aub. "]
["Gelieve hier te antwoorden of naam bijlage te vermelden en het vak naar lengte van het antwoord te vergroten  aub"]
["A.8. Gelieve XX, aub. "]
["Gelieve hier te antwoorden of naam bijlage te vermelden en het vak naar lengte van het antwoord te vergroten  aub"]
["A.10. Gelieve XX, aub. "]
["Gelieve hier te antwoorden of naam bijlage te vermelden en het vak naar lengte van het antwoord te vergroten  aub"]
[]
["VRAGEN PER SPECIFIEKE KOSTENRUBRIEK"]
[]
["PERSONEELSKOSTEN:"]
[]
[{"$f":"Personeelskosten!B6","v":"(naam in te vullen)"}]
[{"$f":"IF(Personeelskosten!V6=0, \"Geen vragen of bemerkingen\",Personeelskosten!V6)","v":"Geen vragen of bemerkingen"}]
["Gelieve hier te antwoorden of naam bijlage te vermelden en het vak naar lengte van het antwoord te vergroten  aub"]
[{"$f":"IF(Personeelskosten!V7=0, \"Geen vragen of bemerkingen\",Personeelskosten!V7)","v":"Geen vragen of bemerkingen"}]
["Gelieve hier te antwoorden of naam bijlage te vermelden en het vak naar lengte van het antwoord te vergroten  aub"]
[{"$f":"IF(Personeelskosten!V8=0, \"Geen vragen of bemerkingen\",Personeelskosten!V8)","v":"Geen vragen of bemerkingen"}]
["Gelieve hier te antwoorden of naam bijlage te vermelden en het vak naar lengte van het antwoord te vergroten  aub"]
[{"$f":"IF(Personeelskosten!V9=0, \"Geen vragen of bemerkingen\",Personeelskosten!V9)","v":"Geen vragen of bemerkingen"}]
["Gelieve hier te antwoorden of naam bijlage te vermelden en het vak naar lengte van het antwoord te vergroten  aub"]
[{"$f":"IF(Personeelskosten!V10=0, \"Geen vragen of bemerkingen\",Personeelskosten!V10)","v":"Geen vragen of bemerkingen"}]
["Gelieve hier te antwoorden of naam bijlage te vermelden en het vak naar lengte van het antwoord te vergroten  aub"]
[{"$f":"IF(Personeelskosten!V11=0, \"Geen vragen of bemerkingen\",Personeelskosten!V11)","v":"Geen vragen of bemerkingen"}]
["Gelieve hier te antwoorden of naam bijlage te vermelden en het vak naar lengte van het antwoord te vergroten  aub"]
[{"$f":"IF(Personeelskosten!V12=0, \"Geen vragen of bemerkingen\",Personeelskosten!V12)","v":"Geen vragen of bemerkingen"}]
["Gelieve hier te antwoorden of naam bijlage te vermelden en het vak naar lengte van het antwoord te vergroten  aub"]
[{"$f":"IF(Personeelskosten!V13=0, \"Geen vragen of bemerkingen\",Personeelskosten!V13)","v":"Geen vragen of bemerkingen"}]
["Gelieve hier te antwoorden of naam bijlage te vermelden en het vak naar lengte van het antwoord te vergroten  aub"]
[{"$f":"IF(Personeelskosten!V14=0, \"Geen vragen of bemerkingen\",Personeelskosten!V14)","v":"Geen vragen of bemerkingen"}]
["Gelieve hier te antwoorden of naam bijlage te vermelden en het vak naar lengte van het antwoord te vergroten  aub"]
[{"$f":"IF(Personeelskosten!V15=0, \"Geen vragen of bemerkingen\",Personeelskosten!V15)","v":"Geen vragen of bemerkingen"}]
["Gelieve hier te antwoorden of naam bijlage te vermelden en het vak naar lengte van het antwoord te vergroten  aub"]
[{"$f":"IF(Personeelskosten!V16=0, \"Geen vragen of bemerkingen\",Personeelskosten!V16)","v":"Geen vragen of bemerkingen"}]
["Gelieve hier te antwoorden of naam bijlage te vermelden en het vak naar lengte van het antwoord te vergroten  aub"]
[{"$f":"IF(Personeelskosten!V17=0, \"Geen vragen of bemerkingen\",Personeelskosten!V17)","v":"Geen vragen of bemerkingen"}]
["Gelieve hier te antwoorden of naam bijlage te vermelden en het vak naar lengte van het antwoord te vergroten  aub"]
[{"$f":"IF(Personeelskosten!V18=0, \"Geen vragen of bemerkingen\",Personeelskosten!V18)","v":"Geen vragen of bemerkingen"}]
["Gelieve hier te antwoorden of naam bijlage te vermelden en het vak naar lengte van het antwoord te vergroten  aub"]
[{"$f":"IF(Personeelskosten!V19=0, \"Geen vragen of bemerkingen\",Personeelskosten!V19)","v":"Geen vragen of bemerkingen"}]
["Gelieve hier te antwoorden of naam bijlage te vermelden en het vak naar lengte van het antwoord te vergroten  aub"]
[{"$f":"IF(Personeelskosten!V20=0, \"Geen vragen of bemerkingen\",Personeelskosten!V20)","v":"Geen vragen of bemerkingen"}]
["Gelieve hier te antwoorden of naam bijlage te vermelden en het vak naar lengte van het antwoord te vergroten  aub"]
[{"$f":"IF(Personeelskosten!V21=0, \"Geen vragen of bemerkingen\",Personeelskosten!V21)","v":"Geen vragen of bemerkingen"}]
["Gelieve hier te antwoorden of naam bijlage te vermelden en het vak naar lengte van het antwoord te vergroten  aub"]
[{"$f":"Personeelskosten!B22","v":"(naam in te vullen)"}]
[{"$f":"IF(Personeelskosten!V22=0, \"Geen vragen of bemerkingen\",Personeelskosten!V22)","v":"Geen vragen of bemerkingen"}]
["Gelieve hier te antwoorden of naam bijlage te vermelden en het vak naar lengte van het antwoord te vergroten  aub"]
[{"$f":"IF(Personeelskosten!V23=0, \"Geen vragen of bemerkingen\",Personeelskosten!V23)","v":"Geen vragen of bemerkingen"}]
["Gelieve hier te antwoorden of naam bijlage te vermelden en het vak naar lengte van het antwoord te vergroten  aub"]
[{"$f":"IF(Personeelskosten!V24=0, \"Geen vragen of bemerkingen\",Personeelskosten!V24)","v":"Geen vragen of bemerkingen"}]
["Gelieve hier te antwoorden of naam bijlage te vermelden en het vak naar lengte van het antwoord te vergroten  aub"]
[{"$f":"IF(Personeelskosten!V25=0, \"Geen vragen of bemerkingen\",Personeelskosten!V25)","v":"Geen vragen of bemerkingen"}]
["Gelieve hier te antwoorden of naam bijlage te vermelden en het vak naar lengte van het antwoord te vergroten  aub"]
[{"$f":"IF(Personeelskosten!V26=0, \"Geen vragen of bemerkingen\",Personeelskosten!V26)","v":"Geen vragen of bemerkingen"}]
["Gelieve hier te antwoorden of naam bijlage te vermelden en het vak naar lengte van het antwoord te vergroten  aub"]
[{"$f":"IF(Personeelskosten!V27=0, \"Geen vragen of bemerkingen\",Personeelskosten!V27)","v":"Geen vragen of bemerkingen"}]
["Gelieve hier te antwoorden of naam bijlage te vermelden en het vak naar lengte van het antwoord te vergroten  aub"]
[{"$f":"IF(Personeelskosten!V28=0, \"Geen vragen of bemerkingen\",Personeelskosten!V28)","v":"Geen vragen of bemerkingen"}]
["Gelieve hier te antwoorden of naam bijlage te vermelden en het vak naar lengte van het antwoord te vergroten  aub"]
[{"$f":"IF(Personeelskosten!V29=0, \"Geen vragen of bemerkingen\",Personeelskosten!V29)","v":"Geen vragen of bemerkingen"}]
["Gelieve hier te antwoorden of naam bijlage te vermelden en het vak naar lengte van het antwoord te vergroten  aub"]
[{"$f":"IF(Personeelskosten!V30=0, \"Geen vragen of bemerkingen\",Personeelskosten!V30)","v":"Geen vragen of bemerkingen"}]
["Gelieve hier te antwoorden of naam bijlage te vermelden en het vak naar lengte van het antwoord te vergroten  aub"]
[{"$f":"IF(Personeelskosten!V31=0, \"Geen vragen of bemerkingen\",Personeelskosten!V31)","v":"Geen vragen of bemerkingen"}]
["Gelieve hier te antwoorden of naam bijlage te vermelden en het vak naar lengte van het antwoord te vergroten  aub"]
[{"$f":"IF(Personeelskosten!V32=0, \"Geen vragen of bemerkingen\",Personeelskosten!V32)","v":"Geen vragen of bemerkingen"}]
["Gelieve hier te antwoorden of naam bijlage te vermelden en het vak naar lengte van het antwoord te vergroten  aub"]
[{"$f":"IF(Personeelskosten!V33=0, \"Geen vragen of bemerkingen\",Personeelskosten!V33)","v":"Geen vragen of bemerkingen"}]
["Gelieve hier te antwoorden of naam bijlage te vermelden en het vak naar lengte van het antwoord te vergroten  aub"]
[{"$f":"IF(Personeelskosten!V34=0, \"Geen vragen of bemerkingen\",Personeelskosten!V34)","v":"Geen vragen of bemerkingen"}]
["Gelieve hier te antwoorden of naam bijlage te vermelden en het vak naar lengte van het antwoord te vergroten  aub"]
[{"$f":"IF(Personeelskosten!V35=0, \"Geen vragen of bemerkingen\",Personeelskosten!V35)","v":"Geen vragen of bemerkingen"}]
["Gelieve hier te antwoorden of naam bijlage te vermelden en het vak naar lengte van het antwoord te vergroten  aub"]
[{"$f":"IF(Personeelskosten!V36=0, \"Geen vragen of bemerkingen\",Personeelskosten!V36)","v":"Geen vragen of bemerkingen"}]
["Gelieve hier te antwoorden of naam bijlage te vermelden en het vak naar lengte van het antwoord te vergroten  aub"]
[{"$f":"IF(Personeelskosten!V37=0, \"Geen vragen of bemerkingen\",Personeelskosten!V37)","v":"Geen vragen of bemerkingen"}]
["Gelieve hier te antwoorden of naam bijlage te vermelden en het vak naar lengte van het antwoord te vergroten  aub"]
[{"$f":"Personeelskosten!B38","v":"(naam in te vullen)"}]
[{"$f":"IF(Personeelskosten!V38=0, \"Geen vragen of bemerkingen\",Personeelskosten!V38)","v":"Geen vragen of bemerkingen"}]
["Gelieve hier te antwoorden of naam bijlage te vermelden en het vak naar lengte van het antwoord te vergroten  aub"]
[{"$f":"IF(Personeelskosten!V39=0, \"Geen vragen of bemerkingen\",Personeelskosten!V39)","v":"Geen vragen of bemerkingen"}]
["Gelieve hier te antwoorden of naam bijlage te vermelden en het vak naar lengte van het antwoord te vergroten  aub"]
[{"$f":"IF(Personeelskosten!V40=0, \"Geen vragen of bemerkingen\",Personeelskosten!V40)","v":"Geen vragen of bemerkingen"}]
["Gelieve hier te antwoorden of naam bijlage te vermelden en het vak naar lengte van het antwoord te vergroten  aub"]
[{"$f":"IF(Personeelskosten!V41=0, \"Geen vragen of bemerkingen\",Personeelskosten!V41)","v":"Geen vragen of bemerkingen"}]
["Gelieve hier te antwoorden of naam bijlage te vermelden en het vak naar lengte van het antwoord te vergroten  aub"]
[{"$f":"IF(Personeelskosten!V42=0, \"Geen vragen of bemerkingen\",Personeelskosten!V42)","v":"Geen vragen of bemerkingen"}]
["Gelieve hier te antwoorden of naam bijlage te vermelden en het vak naar lengte van het antwoord te vergroten  aub"]
[{"$f":"IF(Personeelskosten!V43=0, \"Geen vragen of bemerkingen\",Personeelskosten!V43)","v":"Geen vragen of bemerkingen"}]
["Gelieve hier te antwoorden of naam bijlage te vermelden en het vak naar lengte van het antwoord te vergroten  aub"]
[{"$f":"IF(Personeelskosten!V44=0, \"Geen vragen of bemerkingen\",Personeelskosten!V44)","v":"Geen vragen of bemerkingen"}]
["Gelieve hier te antwoorden of naam bijlage te vermelden en het vak naar lengte van het antwoord te vergroten  aub"]
[{"$f":"IF(Personeelskosten!V45=0, \"Geen vragen of bemerkingen\",Personeelskosten!V45)","v":"Geen vragen of bemerkingen"}]
["Gelieve hier te antwoorden of naam bijlage te vermelden en het vak naar lengte van het antwoord te vergroten  aub"]
[{"$f":"IF(Personeelskosten!V46=0, \"Geen vragen of bemerkingen\",Personeelskosten!V46)","v":"Geen vragen of bemerkingen"}]
["Gelieve hier te antwoorden of naam bijlage te vermelden en het vak naar lengte van het antwoord te vergroten  aub"]
[{"$f":"IF(Personeelskosten!V47=0, \"Geen vragen of bemerkingen\",Personeelskosten!V47)","v":"Geen vragen of bemerkingen"}]
["Gelieve hier te antwoorden of naam bijlage te vermelden en het vak naar lengte van het antwoord te vergroten  aub"]
[{"$f":"IF(Personeelskosten!V48=0, \"Geen vragen of bemerkingen\",Personeelskosten!V48)","v":"Geen vragen of bemerkingen"}]
["Gelieve hier te antwoorden of naam bijlage te vermelden en het vak naar lengte van het antwoord te vergroten  aub"]
[{"$f":"IF(Personeelskosten!V49=0, \"Geen vragen of bemerkingen\",Personeelskosten!V49)","v":"Geen vragen of bemerkingen"}]
["Gelieve hier te antwoorden of naam bijlage te vermelden en het vak naar lengte van het antwoord te vergroten  aub"]
[{"$f":"IF(Personeelskosten!V50=0, \"Geen vragen of bemerkingen\",Personeelskosten!V50)","v":"Geen vragen of bemerkingen"}]
["Gelieve hier te antwoorden of naam bijlage te vermelden en het vak naar lengte van het antwoord te vergroten  aub"]
[{"$f":"IF(Personeelskosten!V51=0, \"Geen vragen of bemerkingen\",Personeelskosten!V51)","v":"Geen vragen of bemerkingen"}]
["Gelieve hier te antwoorden of naam bijlage te vermelden en het vak naar lengte van het antwoord te vergroten  aub"]
[{"$f":"IF(Personeelskosten!V52=0, \"Geen vragen of bemerkingen\",Personeelskosten!V52)","v":"Geen vragen of bemerkingen"}]
["Gelieve hier te antwoorden of naam bijlage te vermelden en het vak naar lengte van het antwoord te vergroten  aub"]
[{"$f":"IF(Personeelskosten!V53=0, \"Geen vragen of bemerkingen\",Personeelskosten!V53)","v":"Geen vragen of bemerkingen"}]
["Gelieve hier te antwoorden of naam bijlage te vermelden en het vak naar lengte van het antwoord te vergroten  aub"]
[{"$f":"Personeelskosten!B54","v":"(naam in te vullen)"}]
[{"$f":"IF(Personeelskosten!V54=0, \"Geen vragen of bemerkingen\",Personeelskosten!V54)","v":"Geen vragen of bemerkingen"}]
["Gelieve hier te antwoorden of naam bijlage te vermelden en het vak naar lengte van het antwoord te vergroten  aub"]
[{"$f":"IF(Personeelskosten!V55=0, \"Geen vragen of bemerkingen\",Personeelskosten!V55)","v":"Geen vragen of bemerkingen"}]
["Gelieve hier te antwoorden of naam bijlage te vermelden en het vak naar lengte van het antwoord te vergroten  aub"]
[{"$f":"IF(Personeelskosten!V56=0, \"Geen vragen of bemerkingen\",Personeelskosten!V56)","v":"Geen vragen of bemerkingen"}]
["Gelieve hier te antwoorden of naam bijlage te vermelden en het vak naar lengte van het antwoord te vergroten  aub"]
[{"$f":"IF(Personeelskosten!V57=0, \"Geen vragen of bemerkingen\",Personeelskosten!V57)","v":"Geen vragen of bemerkingen"}]
["Gelieve hier te antwoorden of naam bijlage te vermelden en het vak naar lengte van het antwoord te vergroten  aub"]
[{"$f":"IF(Personeelskosten!V58=0, \"Geen vragen of bemerkingen\",Personeelskosten!V58)","v":"Geen vragen of bemerkingen"}]
["Gelieve hier te antwoorden of naam bijlage te vermelden en het vak naar lengte van het antwoord te vergroten  aub"]
[{"$f":"IF(Personeelskosten!V59=0, \"Geen vragen of bemerkingen\",Personeelskosten!V59)","v":"Geen vragen of bemerkingen"}]
["Gelieve hier te antwoorden of naam bijlage te vermelden en het vak naar lengte van het antwoord te vergroten  aub"]
[{"$f":"IF(Personeelskosten!V60=0, \"Geen vragen of bemerkingen\",Personeelskosten!V60)","v":"Geen vragen of bemerkingen"}]
["Gelieve hier te antwoorden of naam bijlage te vermelden en het vak naar lengte van het antwoord te vergroten  aub"]
[{"$f":"IF(Personeelskosten!V61=0, \"Geen vragen of bemerkingen\",Personeelskosten!V61)","v":"Geen vragen of bemerkingen"}]
["Gelieve hier te antwoorden of naam bijlage te vermelden en het vak naar lengte van het antwoord te vergroten  aub"]
[{"$f":"IF(Personeelskosten!V62=0, \"Geen vragen of bemerkingen\",Personeelskosten!V62)","v":"Geen vragen of bemerkingen"}]
["Gelieve hier te antwoorden of naam bijlage te vermelden en het vak naar lengte van het antwoord te vergroten  aub"]
[{"$f":"IF(Personeelskosten!V63=0, \"Geen vragen of bemerkingen\",Personeelskosten!V63)","v":"Geen vragen of bemerkingen"}]
["Gelieve hier te antwoorden of naam bijlage te vermelden en het vak naar lengte van het antwoord te vergroten  aub"]
[{"$f":"IF(Personeelskosten!V64=0, \"Geen vragen of bemerkingen\",Personeelskosten!V64)","v":"Geen vragen of bemerkingen"}]
["Gelieve hier te antwoorden of naam bijlage te vermelden en het vak naar lengte van het antwoord te vergroten  aub"]
[{"$f":"IF(Personeelskosten!V65=0, \"Geen vragen of bemerkingen\",Personeelskosten!V65)","v":"Geen vragen of bemerkingen"}]
["Gelieve hier te antwoorden of naam bijlage te vermelden en het vak naar lengte van het antwoord te vergroten  aub"]
[{"$f":"IF(Personeelskosten!V66=0, \"Geen vragen of bemerkingen\",Personeelskosten!V66)","v":"Geen vragen of bemerkingen"}]
["Gelieve hier te antwoorden of naam bijlage te vermelden en het vak naar lengte van het antwoord te vergroten  aub"]
[{"$f":"IF(Personeelskosten!V67=0, \"Geen vragen of bemerkingen\",Personeelskosten!V67)","v":"Geen vragen of bemerkingen"}]
["Gelieve hier te antwoorden of naam bijlage te vermelden en het vak naar lengte van het antwoord te vergroten  aub"]
[{"$f":"IF(Personeelskosten!V68=0, \"Geen vragen of bemerkingen\",Personeelskosten!V68)","v":"Geen vragen of bemerkingen"}]
["Gelieve hier te antwoorden of naam bijlage te vermelden en het vak naar lengte van het antwoord te vergroten  aub"]
[{"$f":"IF(Personeelskosten!V69=0, \"Geen vragen of bemerkingen\",Personeelskosten!V69)","v":"Geen vragen of bemerkingen"}]
["Gelieve hier te antwoorden of naam bijlage te vermelden en het vak naar lengte van het antwoord te vergroten  aub"]
[{"$f":"Personeelskosten!B70","v":"(naam in te vullen)"}]
[{"$f":"IF(Personeelskosten!V70=0, \"Geen vragen of bemerkingen\",Personeelskosten!V70)","v":"Geen vragen of bemerkingen"}]
["Gelieve hier te antwoorden of naam bijlage te vermelden en het vak naar lengte van het antwoord te vergroten  aub"]
[{"$f":"IF(Personeelskosten!V71=0, \"Geen vragen of bemerkingen\",Personeelskosten!V71)","v":"Geen vragen of bemerkingen"}]
["Gelieve hier te antwoorden of naam bijlage te vermelden en het vak naar lengte van het antwoord te vergroten  aub"]
[{"$f":"IF(Personeelskosten!V72=0, \"Geen vragen of bemerkingen\",Personeelskosten!V72)","v":"Geen vragen of bemerkingen"}]
["Gelieve hier te antwoorden of naam bijlage te vermelden en het vak naar lengte van het antwoord te vergroten  aub"]
[{"$f":"IF(Personeelskosten!V73=0, \"Geen vragen of bemerkingen\",Personeelskosten!V73)","v":"Geen vragen of bemerkingen"}]
["Gelieve hier te antwoorden of naam bijlage te vermelden en het vak naar lengte van het antwoord te vergroten  aub"]
[{"$f":"IF(Personeelskosten!V74=0, \"Geen vragen of bemerkingen\",Personeelskosten!V74)","v":"Geen vragen of bemerkingen"}]
["Gelieve hier te antwoorden of naam bijlage te vermelden en het vak naar lengte van het antwoord te vergroten  aub"]
[{"$f":"IF(Personeelskosten!V75=0, \"Geen vragen of bemerkingen\",Personeelskosten!V75)","v":"Geen vragen of bemerkingen"}]
["Gelieve hier te antwoorden of naam bijlage te vermelden en het vak naar lengte van het antwoord te vergroten  aub"]
[{"$f":"IF(Personeelskosten!V76=0, \"Geen vragen of bemerkingen\",Personeelskosten!V76)","v":"Geen vragen of bemerkingen"}]
["Gelieve hier te antwoorden of naam bijlage te vermelden en het vak naar lengte van het antwoord te vergroten  aub"]
[{"$f":"IF(Personeelskosten!V77=0, \"Geen vragen of bemerkingen\",Personeelskosten!V77)","v":"Geen vragen of bemerkingen"}]
["Gelieve hier te antwoorden of naam bijlage te vermelden en het vak naar lengte van het antwoord te vergroten  aub"]
[{"$f":"IF(Personeelskosten!V78=0, \"Geen vragen of bemerkingen\",Personeelskosten!V78)","v":"Geen vragen of bemerkingen"}]
["Gelieve hier te antwoorden of naam bijlage te vermelden en het vak naar lengte van het antwoord te vergroten  aub"]
[{"$f":"IF(Personeelskosten!V79=0, \"Geen vragen of bemerkingen\",Personeelskosten!V79)","v":"Geen vragen of bemerkingen"}]
["Gelieve hier te antwoorden of naam bijlage te vermelden en het vak naar lengte van het antwoord te vergroten  aub"]
[{"$f":"Personeelskosten!B86","v":"(naam in te vullen)"}]
[{"$f":"IF(Personeelskosten!V80=0, \"Geen vragen of bemerkingen\",Personeelskosten!V80)","v":"Geen vragen of bemerkingen"}]
["Gelieve hier te antwoorden of naam bijlage te vermelden en het vak naar lengte van het antwoord te vergroten  aub"]
[{"$f":"IF(Personeelskosten!V81=0, \"Geen vragen of bemerkingen\",Personeelskosten!V81)","v":"Geen vragen of bemerkingen"}]
["Gelieve hier te antwoorden of naam bijlage te vermelden en het vak naar lengte van het antwoord te vergroten  aub"]
[{"$f":"IF(Personeelskosten!V82=0, \"Geen vragen of bemerkingen\",Personeelskosten!V82)","v":"Geen vragen of bemerkingen"}]
["Gelieve hier te antwoorden of naam bijlage te vermelden en het vak naar lengte van het antwoord te vergroten  aub"]
[{"$f":"IF(Personeelskosten!V83=0, \"Geen vragen of bemerkingen\",Personeelskosten!V83)","v":"Geen vragen of bemerkingen"}]
["Gelieve hier te antwoorden of naam bijlage te vermelden en het vak naar lengte van het antwoord te vergroten  aub"]
[{"$f":"IF(Personeelskosten!V84=0, \"Geen vragen of bemerkingen\",Personeelskosten!V84)","v":"Geen vragen of bemerkingen"}]
["Gelieve hier te antwoorden of naam bijlage te vermelden en het vak naar lengte van het antwoord te vergroten  aub"]
[{"$f":"IF(Personeelskosten!V85=0, \"Geen vragen of bemerkingen\",Personeelskosten!V85)","v":"Geen vragen of bemerkingen"}]
["Gelieve hier te antwoorden of naam bijlage te vermelden en het vak naar lengte van het antwoord te vergroten  aub"]
[{"$f":"IF(Personeelskosten!V86=0, \"Geen vragen of bemerkingen\",Personeelskosten!V86)","v":"Geen vragen of bemerkingen"}]
["Gelieve hier te antwoorden of naam bijlage te vermelden en het vak naar lengte van het antwoord te vergroten  aub"]
[{"$f":"IF(Personeelskosten!V87=0, \"Geen vragen of bemerkingen\",Personeelskosten!V87)","v":"Geen vragen of bemerkingen"}]
["Gelieve hier te antwoorden of naam bijlage te vermelden en het vak naar lengte van het antwoord te vergroten  aub"]
[{"$f":"IF(Personeelskosten!V88=0, \"Geen vragen of bemerkingen\",Personeelskosten!V88)","v":"Geen vragen of bemerkingen"}]
["Gelieve hier te antwoorden of naam bijlage te vermelden en het vak naar lengte van het antwoord te vergroten  aub"]
[{"$f":"IF(Personeelskosten!V89=0, \"Geen vragen of bemerkingen\",Personeelskosten!V89)","v":"Geen vragen of bemerkingen"}]
["Gelieve hier te antwoorden of naam bijlage te vermelden en het vak naar lengte van het antwoord te vergroten  aub"]
[{"$f":"IF(Personeelskosten!V90=0, \"Geen vragen of bemerkingen\",Personeelskosten!V90)","v":"Geen vragen of bemerkingen"}]
["Gelieve hier te antwoorden of naam bijlage te vermelden en het vak naar lengte van het antwoord te vergroten  aub"]
[{"$f":"IF(Personeelskosten!V91=0, \"Geen vragen of bemerkingen\",Personeelskosten!V91)","v":"Geen vragen of bemerkingen"}]
["Gelieve hier te antwoorden of naam bijlage te vermelden en het vak naar lengte van het antwoord te vergroten  aub"]
[{"$f":"IF(Personeelskosten!V92=0, \"Geen vragen of bemerkingen\",Personeelskosten!V92)","v":"Geen vragen of bemerkingen"}]
["Gelieve hier te antwoorden of naam bijlage te vermelden en het vak naar lengte van het antwoord te vergroten  aub"]
[{"$f":"IF(Personeelskosten!V93=0, \"Geen vragen of bemerkingen\",Personeelskosten!V93)","v":"Geen vragen of bemerkingen"}]
["Gelieve hier te antwoorden of naam bijlage te vermelden en het vak naar lengte van het antwoord te vergroten  aub"]
[{"$f":"IF(Personeelskosten!V94=0, \"Geen vragen of bemerkingen\",Personeelskosten!V94)","v":"Geen vragen of bemerkingen"}]
["Gelieve hier te antwoorden of naam bijlage te vermelden en het vak naar lengte van het antwoord te vergroten  aub"]
[{"$f":"IF(Personeelskosten!V95=0, \"Geen vragen of bemerkingen\",Personeelskosten!V95)","v":"Geen vragen of bemerkingen"}]
["Gelieve hier te antwoorden of naam bijlage te vermelden en het vak naar lengte van het antwoord te vergroten  aub"]
[{"$f":"IF(Personeelskosten!V96=0, \"Geen vragen of bemerkingen\",Personeelskosten!V96)","v":"Geen vragen of bemerkingen"}]
["Gelieve hier te antwoorden of naam bijlage te vermelden en het vak naar lengte van het antwoord te vergroten  aub"]
[{"$f":"IF(Personeelskosten!V97=0, \"Geen vragen of bemerkingen\",Personeelskosten!V97)","v":"Geen vragen of bemerkingen"}]
["Gelieve hier te antwoorden of naam bijlage te vermelden en het vak naar lengte van het antwoord te vergroten  aub"]
[{"$f":"IF(Personeelskosten!V98=0, \"Geen vragen of bemerkingen\",Personeelskosten!V98)","v":"Geen vragen of bemerkingen"}]
["Gelieve hier te antwoorden of naam bijlage te vermelden en het vak naar lengte van het antwoord te vergroten  aub"]
[{"$f":"IF(Personeelskosten!V99=0, \"Geen vragen of bemerkingen\",Personeelskosten!V99)","v":"Geen vragen of bemerkingen"}]
["Gelieve hier te antwoorden of naam bijlage te vermelden en het vak naar lengte van het antwoord te vergroten  aub"]
[{"$f":"IF(Personeelskosten!V100=0, \"Geen vragen of bemerkingen\",Personeelskosten!V100)","v":"Geen vragen of bemerkingen"}]
["Gelieve hier te antwoorden of naam bijlage te vermelden en het vak naar lengte van het antwoord te vergroten  aub"]
[{"$f":"IF(Personeelskosten!V101=0, \"Geen vragen of bemerkingen\",Personeelskosten!V101)","v":"Geen vragen of bemerkingen"}]
["Gelieve hier te antwoorden of naam bijlage te vermelden en het vak naar lengte van het antwoord te vergroten  aub"]
[{"$f":"Personeelskosten!B102","v":"(naam in te vullen)"}]
[{"$f":"IF(Personeelskosten!V102=0, \"Geen vragen of bemerkingen\",Personeelskosten!V102)","v":"Geen vragen of bemerkingen"}]
["Gelieve hier te antwoorden of naam bijlage te vermelden en het vak naar lengte van het antwoord te vergroten  aub"]
[{"$f":"IF(Personeelskosten!V103=0, \"Geen vragen of bemerkingen\",Personeelskosten!V103)","v":"Geen vragen of bemerkingen"}]
["Gelieve hier te antwoorden of naam bijlage te vermelden en het vak naar lengte van het antwoord te vergroten  aub"]
[{"$f":"IF(Personeelskosten!V104=0, \"Geen vragen of bemerkingen\",Personeelskosten!V104)","v":"Geen vragen of bemerkingen"}]
["Gelieve hier te antwoorden of naam bijlage te vermelden en het vak naar lengte van het antwoord te vergroten  aub"]
[{"$f":"IF(Personeelskosten!V105=0, \"Geen vragen of bemerkingen\",Personeelskosten!V105)","v":"Geen vragen of bemerkingen"}]
["Gelieve hier te antwoorden of naam bijlage te vermelden en het vak naar lengte van het antwoord te vergroten  aub"]
[{"$f":"IF(Personeelskosten!V106=0, \"Geen vragen of bemerkingen\",Personeelskosten!V106)","v":"Geen vragen of bemerkingen"}]
["Gelieve hier te antwoorden of naam bijlage te vermelden en het vak naar lengte van het antwoord te vergroten  aub"]
[{"$f":"IF(Personeelskosten!V107=0, \"Geen vragen of bemerkingen\",Personeelskosten!V107)","v":"Geen vragen of bemerkingen"}]
["Gelieve hier te antwoorden of naam bijlage te vermelden en het vak naar lengte van het antwoord te vergroten  aub"]
[{"$f":"IF(Personeelskosten!V109=0, \"Geen vragen of bemerkingen\",Personeelskosten!V109)","v":"Geen vragen of bemerkingen"}]
["Gelieve hier te antwoorden of naam bijlage te vermelden en het vak naar lengte van het antwoord te vergroten  aub"]
[{"$f":"IF(Personeelskosten!V110=0, \"Geen vragen of bemerkingen\",Personeelskosten!V110)","v":"Geen vragen of bemerkingen"}]
["Gelieve hier te antwoorden of naam bijlage te vermelden en het vak naar lengte van het antwoord te vergroten  aub"]
[{"$f":"IF(Personeelskosten!V111=0, \"Geen vragen of bemerkingen\",Personeelskosten!V111)","v":"Geen vragen of bemerkingen"}]
["Gelieve hier te antwoorden of naam bijlage te vermelden en het vak naar lengte van het antwoord te vergroten  aub"]
[{"$f":"IF(Personeelskosten!V112=0, \"Geen vragen of bemerkingen\",Personeelskosten!V112)","v":"Geen vragen of bemerkingen"}]
["Gelieve hier te antwoorden of naam bijlage te vermelden en het vak naar lengte van het antwoord te vergroten  aub"]
[{"$f":"IF(Personeelskosten!V113=0, \"Geen vragen of bemerkingen\",Personeelskosten!V113)","v":"Geen vragen of bemerkingen"}]
["Gelieve hier te antwoorden of naam bijlage te vermelden en het vak naar lengte van het antwoord te vergroten  aub"]
[{"$f":"IF(Personeelskosten!V114=0, \"Geen vragen of bemerkingen\",Personeelskosten!V114)","v":"Geen vragen of bemerkingen"}]
["Gelieve hier te antwoorden of naam bijlage te vermelden en het vak naar lengte van het antwoord te vergroten  aub"]
[{"$f":"IF(Personeelskosten!V115=0, \"Geen vragen of bemerkingen\",Personeelskosten!V115)","v":"Geen vragen of bemerkingen"}]
["Gelieve hier te antwoorden of naam bijlage te vermelden en het vak naar lengte van het antwoord te vergroten  aub"]
[{"$f":"IF(Personeelskosten!V116=0, \"Geen vragen of bemerkingen\",Personeelskosten!V116)","v":"Geen vragen of bemerkingen"}]
["Gelieve hier te antwoorden of naam bijlage te vermelden en het vak naar lengte van het antwoord te vergroten  aub"]
[{"$f":"IF(Personeelskosten!V117=0, \"Geen vragen of bemerkingen\",Personeelskosten!V117)","v":"Geen vragen of bemerkingen"}]
["Gelieve hier te antwoorden of naam bijlage te vermelden en het vak naar lengte van het antwoord te vergroten  aub"]
[{"$f":"Personeelskosten!B118","v":"(naam in te vullen)"}]
[{"$f":"IF(Personeelskosten!V118=0, \"Geen vragen of bemerkingen\",Personeelskosten!V118)","v":"Geen vragen of bemerkingen"}]
["Gelieve hier te antwoorden of naam bijlage te vermelden en het vak naar lengte van het antwoord te vergroten  aub"]
[{"$f":"IF(Personeelskosten!V119=0, \"Geen vragen of bemerkingen\",Personeelskosten!V119)","v":"Geen vragen of bemerkingen"}]
["Gelieve hier te antwoorden of naam bijlage te vermelden en het vak naar lengte van het antwoord te vergroten  aub"]
[{"$f":"IF(Personeelskosten!V120=0, \"Geen vragen of bemerkingen\",Personeelskosten!V120)","v":"Geen vragen of bemerkingen"}]
["Gelieve hier te antwoorden of naam bijlage te vermelden en het vak naar lengte van het antwoord te vergroten  aub"]
[{"$f":"IF(Personeelskosten!V121=0, \"Geen vragen of bemerkingen\",Personeelskosten!V121)","v":"Geen vragen of bemerkingen"}]
["Gelieve hier te antwoorden of naam bijlage te vermelden en het vak naar lengte van het antwoord te vergroten  aub"]
[{"$f":"IF(Personeelskosten!V122=0, \"Geen vragen of bemerkingen\",Personeelskosten!V122)","v":"Geen vragen of bemerkingen"}]
["Gelieve hier te antwoorden of naam bijlage te vermelden en het vak naar lengte van het antwoord te vergroten  aub"]
[{"$f":"IF(Personeelskosten!V123=0, \"Geen vragen of bemerkingen\",Personeelskosten!V123)","v":"Geen vragen of bemerkingen"}]
["Gelieve hier te antwoorden of naam bijlage te vermelden en het vak naar lengte van het antwoord te vergroten  aub"]
[{"$f":"IF(Personeelskosten!V124=0, \"Geen vragen of bemerkingen\",Personeelskosten!V124)","v":"Geen vragen of bemerkingen"}]
["Gelieve hier te antwoorden of naam bijlage te vermelden en het vak naar lengte van het antwoord te vergroten  aub"]
[{"$f":"IF(Personeelskosten!V125=0, \"Geen vragen of bemerkingen\",Personeelskosten!V125)","v":"Geen vragen of bemerkingen"}]
["Gelieve hier te antwoorden of naam bijlage te vermelden en het vak naar lengte van het antwoord te vergroten  aub"]
[{"$f":"IF(Personeelskosten!V126=0, \"Geen vragen of bemerkingen\",Personeelskosten!V126)","v":"Geen vragen of bemerkingen"}]
["Gelieve hier te antwoorden of naam bijlage te vermelden en het vak naar lengte van het antwoord te vergroten  aub"]
[{"$f":"IF(Personeelskosten!V127=0, \"Geen vragen of bemerkingen\",Personeelskosten!V127)","v":"Geen vragen of bemerkingen"}]
["Gelieve hier te antwoorden of naam bijlage te vermelden en het vak naar lengte van het antwoord te vergroten  aub"]
[{"$f":"IF(Personeelskosten!V128=0, \"Geen vragen of bemerkingen\",Personeelskosten!V128)","v":"Geen vragen of bemerkingen"}]
["Gelieve hier te antwoorden of naam bijlage te vermelden en het vak naar lengte van het antwoord te vergroten  aub"]
[{"$f":"IF(Personeelskosten!V129=0, \"Geen vragen of bemerkingen\",Personeelskosten!V129)","v":"Geen vragen of bemerkingen"}]
["Gelieve hier te antwoorden of naam bijlage te vermelden en het vak naar lengte van het antwoord te vergroten  aub"]
[{"$f":"IF(Personeelskosten!V130=0, \"Geen vragen of bemerkingen\",Personeelskosten!V130)","v":"Geen vragen of bemerkingen"}]
["Gelieve hier te antwoorden of naam bijlage te vermelden en het vak naar lengte van het antwoord te vergroten  aub"]
[{"$f":"IF(Personeelskosten!V131=0, \"Geen vragen of bemerkingen\",Personeelskosten!V131)","v":"Geen vragen of bemerkingen"}]
["Gelieve hier te antwoorden of naam bijlage te vermelden en het vak naar lengte van het antwoord te vergroten  aub"]
[]
["HUUR:"]
[]
[{"$f":"IF(Huur!O6=0, \"Geen vragen of bemerkingen\",Huur!O6)","v":"Geen vragen of bemerkingen"}]
["Gelieve hier te antwoorden of naam bijlage te vermelden en het vak naar lengte van het antwoord te vergroten  aub"]
[{"$f":"IF(Huur!O7=0, \"Geen vragen of bemerkingen\",Huur!O7)","v":"Geen vragen of bemerkingen"}]
["Gelieve hier te antwoorden of naam bijlage te vermelden en het vak naar lengte van het antwoord te vergroten  aub"]
[{"$f":"IF(Huur!O8=0, \"Geen vragen of bemerkingen\",Huur!O8)","v":"Geen vragen of bemerkingen"}]
["Gelieve hier te antwoorden of naam bijlage te vermelden en het vak naar lengte van het antwoord te vergroten  aub"]
[{"$f":"IF(Huur!O9=0, \"Geen vragen of bemerkingen\",Huur!O9)","v":"Geen vragen of bemerkingen"}]
["Gelieve hier te antwoorden of naam bijlage te vermelden en het vak naar lengte van het antwoord te vergroten  aub"]
[{"$f":"IF(Huur!O10=0, \"Geen vragen of bemerkingen\",Huur!O10)","v":"Geen vragen of bemerkingen"}]
["Gelieve hier te antwoorden of naam bijlage te vermelden en het vak naar lengte van het antwoord te vergroten  aub"]
[{"$f":"IF(Huur!O11=0, \"Geen vragen of bemerkingen\",Huur!O11)","v":"Geen vragen of bemerkingen"}]
["Gelieve hier te antwoorden of naam bijlage te vermelden en het vak naar lengte van het antwoord te vergroten  aub"]
[{"$f":"IF(Huur!O12=0, \"Geen vragen of bemerkingen\",Huur!O12)","v":"Geen vragen of bemerkingen"}]
["Gelieve hier te antwoorden of naam bijlage te vermelden en het vak naar lengte van het antwoord te vergroten  aub"]
[{"$f":"IF(Huur!O13=0, \"Geen vragen of bemerkingen\",Huur!O13)","v":"Geen vragen of bemerkingen"}]
["Gelieve hier te antwoorden of naam bijlage te vermelden en het vak naar lengte van het antwoord te vergroten  aub"]
[{"$f":"IF(Huur!O14=0, \"Geen vragen of bemerkingen\",Huur!O14)","v":"Geen vragen of bemerkingen"}]
["Gelieve hier te antwoorden of naam bijlage te vermelden en het vak naar lengte van het antwoord te vergroten  aub"]
[{"$f":"IF(Huur!O15=0, \"Geen vragen of bemerkingen\",Huur!O15)","v":"Geen vragen of bemerkingen"}]
["Gelieve hier te antwoorden of naam bijlage te vermelden en het vak naar lengte van het antwoord te vergroten  aub"]
[{"$f":"IF(Huur!O16=0, \"Geen vragen of bemerkingen\",Huur!O16)","v":"Geen vragen of bemerkingen"}]
["Gelieve hier te antwoorden of naam bijlage te vermelden en het vak naar lengte van het antwoord te vergroten  aub"]
[{"$f":"IF(Huur!O17=0, \"Geen vragen of bemerkingen\",Huur!O17)","v":"Geen vragen of bemerkingen"}]
["Gelieve hier te antwoorden of naam bijlage te vermelden en het vak naar lengte van het antwoord te vergroten  aub"]
[{"$f":"IF(Huur!O18=0, \"Geen vragen of bemerkingen\",Huur!O18)","v":"Geen vragen of bemerkingen"}]
["Gelieve hier te antwoorden of naam bijlage te vermelden en het vak naar lengte van het antwoord te vergroten  aub"]
[]
["INVESTERINGEN:"]
[]
[{"$f":"IF(Investeringen!Q6=0, \"Geen vragen of bemerkingen\",Investeringen!Q6)","v":"Geen vragen of bemerkingen"}]
["Gelieve hier te antwoorden of naam bijlage te vermelden en het vak naar lengte van het antwoord te vergroten  aub"]
[{"$f":"IF(Investeringen!Q7=0, \"Geen vragen of bemerkingen\",Investeringen!Q7)","v":"Geen vragen of bemerkingen"}]
["Gelieve hier te antwoorden of naam bijlage te vermelden en het vak naar lengte van het antwoord te vergroten  aub"]
[{"$f":"IF(Investeringen!Q8=0, \"Geen vragen of bemerkingen\",Investeringen!Q8)","v":"Geen vragen of bemerkingen"}]
["Gelieve hier te antwoorden of naam bijlage te vermelden en het vak naar lengte van het antwoord te vergroten  aub"]
[{"$f":"IF(Investeringen!Q9=0, \"Geen vragen of bemerkingen\",Investeringen!Q9)","v":"Geen vragen of bemerkingen"}]
["Gelieve hier te antwoorden of naam bijlage te vermelden en het vak naar lengte van het antwoord te vergroten  aub"]
[{"$f":"IF(Investeringen!Q10=0, \"Geen vragen of bemerkingen\",Investeringen!Q10)","v":"Geen vragen of bemerkingen"}]
["Gelieve hier te antwoorden of naam bijlage te vermelden en het vak naar lengte van het antwoord te vergroten  aub"]
[]
["DIRECTE WERKINGSKOSTEN:"]
[]
[{"$f":"'Directe werkingskosten'!D6","v":"Kies uit lijst Directe Werkingskosten "}]
[]
[{"$f":"IF('Directe werkingskosten'!T6=0, \"Geen vragen of bemerkingen\",'Directe werkingskosten'!T6)","v":"Geen vragen of bemerkingen"}]
["Gelieve hier te antwoorden of naam bijlage te vermelden en het vak naar lengte van het antwoord te vergroten  aub"]
[{"$f":"IF('Directe werkingskosten'!T7=0, \"Geen vragen of bemerkingen\",'Directe werkingskosten'!T7)","v":"Geen vragen of bemerkingen"}]
["Gelieve hier te antwoorden of naam bijlage te vermelden en het vak naar lengte van het antwoord te vergroten  aub"]
[{"$f":"IF('Directe werkingskosten'!T8=0, \"Geen vragen of bemerkingen\",'Directe werkingskosten'!T8)","v":"Geen vragen of bemerkingen"}]
["Gelieve hier te antwoorden of naam bijlage te vermelden en het vak naar lengte van het antwoord te vergroten  aub"]
[{"$f":"IF('Directe werkingskosten'!T9=0, \"Geen vragen of bemerkingen\",'Directe werkingskosten'!T9)","v":"Geen vragen of bemerkingen"}]
["Gelieve hier te antwoorden of naam bijlage te vermelden en het vak naar lengte van het antwoord te vergroten  aub"]
[{"$f":"IF('Directe werkingskosten'!T10=0, \"Geen vragen of bemerkingen\",'Directe werkingskosten'!T10)","v":"Geen vragen of bemerkingen"}]
["Gelieve hier te antwoorden of naam bijlage te vermelden en het vak naar lengte van het antwoord te vergroten  aub"]
[{"$f":"IF('Directe werkingskosten'!T11=0, \"Geen vragen of bemerkingen\",'Directe werkingskosten'!T11)","v":"Geen vragen of bemerkingen"}]
["Gelieve hier te antwoorden of naam bijlage te vermelden en het vak naar lengte van het antwoord te vergroten  aub"]
[{"$f":"IF('Directe werkingskosten'!T12=0, \"Geen vragen of bemerkingen\",'Directe werkingskosten'!T12)","v":"Geen vragen of bemerkingen"}]
["Gelieve hier te antwoorden of naam bijlage te vermelden en het vak naar lengte van het antwoord te vergroten  aub"]
[{"$f":"IF('Directe werkingskosten'!T13=0, \"Geen vragen of bemerkingen\",'Directe werkingskosten'!T13)","v":"Geen vragen of bemerkingen"}]
["Gelieve hier te antwoorden of naam bijlage te vermelden en het vak naar lengte van het antwoord te vergroten  aub"]
[{"$f":"IF('Directe werkingskosten'!T14=0, \"Geen vragen of bemerkingen\",'Directe werkingskosten'!T14)","v":"Geen vragen of bemerkingen"}]
["Gelieve hier te antwoorden of naam bijlage te vermelden en het vak naar lengte van het antwoord te vergroten  aub"]
[{"$f":"IF('Directe werkingskosten'!T15=0, \"Geen vragen of bemerkingen\",'Directe werkingskosten'!T15)","v":"Geen vragen of bemerkingen"}]
["Gelieve hier te antwoorden of naam bijlage te vermelden en het vak naar lengte van het antwoord te vergroten  aub"]
[{"$f":"IF('Directe werkingskosten'!T16=0, \"Geen vragen of bemerkingen\",'Directe werkingskosten'!T16)","v":"Geen vragen of bemerkingen"}]
["Gelieve hier te antwoorden of naam bijlage te vermelden en het vak naar lengte van het antwoord te vergroten  aub"]
[{"$f":"IF('Directe werkingskosten'!T17=0, \"Geen vragen of bemerkingen\",'Directe werkingskosten'!T17)","v":"Geen vragen of bemerkingen"}]
["Gelieve hier te antwoorden of naam bijlage te vermelden en het vak naar lengte van het antwoord te vergroten  aub"]
[{"$f":"IF('Directe werkingskosten'!T18=0, \"Geen vragen of bemerkingen\",'Directe werkingskosten'!T18)","v":"Geen vragen of bemerkingen"}]
["Gelieve hier te antwoorden of naam bijlage te vermelden en het vak naar lengte van het antwoord te vergroten  aub"]
[]
[{"$f":"'Directe werkingskosten'!D19","v":"Kies uit lijst Directe Werkingskosten "}]
[]
[{"$f":"IF('Directe werkingskosten'!T19=0, \"Geen vragen of bemerkingen\",'Directe werkingskosten'!T19)","v":"Geen vragen of bemerkingen"}]
["Gelieve hier te antwoorden of naam bijlage te vermelden en het vak naar lengte van het antwoord te vergroten  aub"]
[{"$f":"IF('Directe werkingskosten'!T20=0, \"Geen vragen of bemerkingen\",'Directe werkingskosten'!T20)","v":"Geen vragen of bemerkingen"}]
["Gelieve hier te antwoorden of naam bijlage te vermelden en het vak naar lengte van het antwoord te vergroten  aub"]
[{"$f":"IF('Directe werkingskosten'!T21=0, \"Geen vragen of bemerkingen\",'Directe werkingskosten'!T21)","v":"Geen vragen of bemerkingen"}]
["Gelieve hier te antwoorden of naam bijlage te vermelden en het vak naar lengte van het antwoord te vergroten  aub"]
[{"$f":"IF('Directe werkingskosten'!T22=0, \"Geen vragen of bemerkingen\",'Directe werkingskosten'!T22)","v":"Geen vragen of bemerkingen"}]
["Gelieve hier te antwoorden of naam bijlage te vermelden en het vak naar lengte van het antwoord te vergroten  aub"]
[{"$f":"IF('Directe werkingskosten'!T23=0, \"Geen vragen of bemerkingen\",'Directe werkingskosten'!T23)","v":"Geen vragen of bemerkingen"}]
["Gelieve hier te antwoorden of naam bijlage te vermelden en het vak naar lengte van het antwoord te vergroten  aub"]
[{"$f":"IF('Directe werkingskosten'!T24=0, \"Geen vragen of bemerkingen\",'Directe werkingskosten'!T24)","v":"Geen vragen of bemerkingen"}]
["Gelieve hier te antwoorden of naam bijlage te vermelden en het vak naar lengte van het antwoord te vergroten  aub"]
[{"$f":"IF('Directe werkingskosten'!T25=0, \"Geen vragen of bemerkingen\",'Directe werkingskosten'!T25)","v":"Geen vragen of bemerkingen"}]
["Gelieve hier te antwoorden of naam bijlage te vermelden en het vak naar lengte van het antwoord te vergroten  aub"]
[{"$f":"IF('Directe werkingskosten'!T26=0, \"Geen vragen of bemerkingen\",'Directe werkingskosten'!T26)","v":"Geen vragen of bemerkingen"}]
["Gelieve hier te antwoorden of naam bijlage te vermelden en het vak naar lengte van het antwoord te vergroten  aub"]
[{"$f":"IF('Directe werkingskosten'!T27=0, \"Geen vragen of bemerkingen\",'Directe werkingskosten'!T27)","v":"Geen vragen of bemerkingen"}]
["Gelieve hier te antwoorden of naam bijlage te vermelden en het vak naar lengte van het antwoord te vergroten  aub"]
[{"$f":"IF('Directe werkingskosten'!T28=0, \"Geen vragen of bemerkingen\",'Directe werkingskosten'!T28)","v":"Geen vragen of bemerkingen"}]
["Gelieve hier te antwoorden of naam bijlage te vermelden en het vak naar lengte van het antwoord te vergroten  aub"]
[{"$f":"IF('Directe werkingskosten'!T29=0, \"Geen vragen of bemerkingen\",'Directe werkingskosten'!T29)","v":"Geen vragen of bemerkingen"}]
["Gelieve hier te antwoorden of naam bijlage te vermelden en het vak naar lengte van het antwoord te vergroten  aub"]
[{"$f":"IF('Directe werkingskosten'!T30=0, \"Geen vragen of bemerkingen\",'Directe werkingskosten'!T30)","v":"Geen vragen of bemerkingen"}]
["Gelieve hier te antwoorden of naam bijlage te vermelden en het vak naar lengte van het antwoord te vergroten  aub"]
[{"$f":"IF('Directe werkingskosten'!T31=0, \"Geen vragen of bemerkingen\",'Directe werkingskosten'!T31)","v":"Geen vragen of bemerkingen"}]
["Gelieve hier te antwoorden of naam bijlage te vermelden en het vak naar lengte van het antwoord te vergroten  aub"]
[]
[{"$f":"'Directe werkingskosten'!D32","v":"Kies uit lijst Directe Werkingskosten "}]
[]
[{"$f":"IF('Directe werkingskosten'!T32=0, \"Geen vragen of bemerkingen\",'Directe werkingskosten'!T32)","v":"Geen vragen of bemerkingen"}]
["Gelieve hier te antwoorden of naam bijlage te vermelden en het vak naar lengte van het antwoord te vergroten  aub"]
[{"$f":"IF('Directe werkingskosten'!T33=0, \"Geen vragen of bemerkingen\",'Directe werkingskosten'!T33)","v":"Geen vragen of bemerkingen"}]
["Gelieve hier te antwoorden of naam bijlage te vermelden en het vak naar lengte van het antwoord te vergroten  aub"]
[{"$f":"IF('Directe werkingskosten'!T34=0, \"Geen vragen of bemerkingen\",'Directe werkingskosten'!T34)","v":"Geen vragen of bemerkingen"}]
["Gelieve hier te antwoorden of naam bijlage te vermelden en het vak naar lengte van het antwoord te vergroten  aub"]
[{"$f":"IF('Directe werkingskosten'!T35=0, \"Geen vragen of bemerkingen\",'Directe werkingskosten'!T35)","v":"Geen vragen of bemerkingen"}]
["Gelieve hier te antwoorden of naam bijlage te vermelden en het vak naar lengte van het antwoord te vergroten  aub"]
[{"$f":"IF('Directe werkingskosten'!T36=0, \"Geen vragen of bemerkingen\",'Directe werkingskosten'!T36)","v":"Geen vragen of bemerkingen"}]
["Gelieve hier te antwoorden of naam bijlage te vermelden en het vak naar lengte van het antwoord te vergroten  aub"]
[{"$f":"IF('Directe werkingskosten'!T37=0, \"Geen vragen of bemerkingen\",'Directe werkingskosten'!T37)","v":"Geen vragen of bemerkingen"}]
["Gelieve hier te antwoorden of naam bijlage te vermelden en het vak naar lengte van het antwoord te vergroten  aub"]
[{"$f":"IF('Directe werkingskosten'!T38=0, \"Geen vragen of bemerkingen\",'Directe werkingskosten'!T38)","v":"Geen vragen of bemerkingen"}]
["Gelieve hier te antwoorden of naam bijlage te vermelden en het vak naar lengte van het antwoord te vergroten  aub"]
[{"$f":"IF('Directe werkingskosten'!T39=0, \"Geen vragen of bemerkingen\",'Directe werkingskosten'!T39)","v":"Geen vragen of bemerkingen"}]
["Gelieve hier te antwoorden of naam bijlage te vermelden en het vak naar lengte van het antwoord te vergroten  aub"]
[{"$f":"IF('Directe werkingskosten'!T40=0, \"Geen vragen of bemerkingen\",'Directe werkingskosten'!T40)","v":"Geen vragen of bemerkingen"}]
["Gelieve hier te antwoorden of naam bijlage te vermelden en het vak naar lengte van het antwoord te vergroten  aub"]
[{"$f":"IF('Directe werkingskosten'!T41=0, \"Geen vragen of bemerkingen\",'Directe werkingskosten'!T41)","v":"Geen vragen of bemerkingen"}]
["Gelieve hier te antwoorden of naam bijlage te vermelden en het vak naar lengte van het antwoord te vergroten  aub"]
[{"$f":"IF('Directe werkingskosten'!T42=0, \"Geen vragen of bemerkingen\",'Directe werkingskosten'!T42)","v":"Geen vragen of bemerkingen"}]
["Gelieve hier te antwoorden of naam bijlage te vermelden en het vak naar lengte van het antwoord te vergroten  aub"]
[{"$f":"IF('Directe werkingskosten'!T43=0, \"Geen vragen of bemerkingen\",'Directe werkingskosten'!T43)","v":"Geen vragen of bemerkingen"}]
["Gelieve hier te antwoorden of naam bijlage te vermelden en het vak naar lengte van het antwoord te vergroten  aub"]
[{"$f":"IF('Directe werkingskosten'!T44=0, \"Geen vragen of bemerkingen\",'Directe werkingskosten'!T44)","v":"Geen vragen of bemerkingen"}]
["Gelieve hier te antwoorden of naam bijlage te vermelden en het vak naar lengte van het antwoord te vergroten  aub"]
[]
[{"$f":"'Directe werkingskosten'!D45","v":"Kies uit lijst Directe Werkingskosten "}]
[]
[{"$f":"IF('Directe werkingskosten'!T45=0, \"Geen vragen of bemerkingen\",'Directe werkingskosten'!T45)","v":"Geen vragen of bemerkingen"}]
["Gelieve hier te antwoorden of naam bijlage te vermelden en het vak naar lengte van het antwoord te vergroten  aub"]
[{"$f":"IF('Directe werkingskosten'!T46=0, \"Geen vragen of bemerkingen\",'Directe werkingskosten'!T46)","v":"Geen vragen of bemerkingen"}]
["Gelieve hier te antwoorden of naam bijlage te vermelden en het vak naar lengte van het antwoord te vergroten  aub"]
[{"$f":"IF('Directe werkingskosten'!T47=0, \"Geen vragen of bemerkingen\",'Directe werkingskosten'!T47)","v":"Geen vragen of bemerkingen"}]
["Gelieve hier te antwoorden of naam bijlage te vermelden en het vak naar lengte van het antwoord te vergroten  aub"]
[{"$f":"IF('Directe werkingskosten'!T48=0, \"Geen vragen of bemerkingen\",'Directe werkingskosten'!T48)","v":"Geen vragen of bemerkingen"}]
["Gelieve hier te antwoorden of naam bijlage te vermelden en het vak naar lengte van het antwoord te vergroten  aub"]
[{"$f":"IF('Directe werkingskosten'!T49=0, \"Geen vragen of bemerkingen\",'Directe werkingskosten'!T49)","v":"Geen vragen of bemerkingen"}]
["Gelieve hier te antwoorden of naam bijlage te vermelden en het vak naar lengte van het antwoord te vergroten  aub"]
[{"$f":"IF('Directe werkingskosten'!T50=0, \"Geen vragen of bemerkingen\",'Directe werkingskosten'!T50)","v":"Geen vragen of bemerkingen"}]
["Gelieve hier te antwoorden of naam bijlage te vermelden en het vak naar lengte van het antwoord te vergroten  aub"]
[{"$f":"IF('Directe werkingskosten'!T51=0, \"Geen vragen of bemerkingen\",'Directe werkingskosten'!T51)","v":"Geen vragen of bemerkingen"}]
["Gelieve hier te antwoorden of naam bijlage te vermelden en het vak naar lengte van het antwoord te vergroten  aub"]
[{"$f":"IF('Directe werkingskosten'!T52=0, \"Geen vragen of bemerkingen\",'Directe werkingskosten'!T52)","v":"Geen vragen of bemerkingen"}]
["Gelieve hier te antwoorden of naam bijlage te vermelden en het vak naar lengte van het antwoord te vergroten  aub"]
[{"$f":"IF('Directe werkingskosten'!T53=0, \"Geen vragen of bemerkingen\",'Directe werkingskosten'!T53)","v":"Geen vragen of bemerkingen"}]
["Gelieve hier te antwoorden of naam bijlage te vermelden en het vak naar lengte van het antwoord te vergroten  aub"]
[{"$f":"IF('Directe werkingskosten'!T54=0, \"Geen vragen of bemerkingen\",'Directe werkingskosten'!T54)","v":"Geen vragen of bemerkingen"}]
["Gelieve hier te antwoorden of naam bijlage te vermelden en het vak naar lengte van het antwoord te vergroten  aub"]
[{"$f":"IF('Directe werkingskosten'!T55=0, \"Geen vragen of bemerkingen\",'Directe werkingskosten'!T55)","v":"Geen vragen of bemerkingen"}]
["Gelieve hier te antwoorden of naam bijlage te vermelden en het vak naar lengte van het antwoord te vergroten  aub"]
[{"$f":"IF('Directe werkingskosten'!T56=0, \"Geen vragen of bemerkingen\",'Directe werkingskosten'!T56)","v":"Geen vragen of bemerkingen"}]
["Gelieve hier te antwoorden of naam bijlage te vermelden en het vak naar lengte van het antwoord te vergroten  aub"]
[{"$f":"IF('Directe werkingskosten'!T57=0, \"Geen vragen of bemerkingen\",'Directe werkingskosten'!T57)","v":"Geen vragen of bemerkingen"}]
["Gelieve hier te antwoorden of naam bijlage te vermelden en het vak naar lengte van het antwoord te vergroten  aub"]
[]
[{"$f":"'Directe werkingskosten'!D58","v":"Kies uit lijst Directe Werkingskosten "}]
[]
[{"$f":"IF('Directe werkingskosten'!T58=0, \"Geen vragen of bemerkingen\",'Directe werkingskosten'!T58)","v":"Geen vragen of bemerkingen"}]
["Gelieve hier te antwoorden of naam bijlage te vermelden en het vak naar lengte van het antwoord te vergroten  aub"]
[{"$f":"IF('Directe werkingskosten'!T59=0, \"Geen vragen of bemerkingen\",'Directe werkingskosten'!T59)","v":"Geen vragen of bemerkingen"}]
["Gelieve hier te antwoorden of naam bijlage te vermelden en het vak naar lengte van het antwoord te vergroten  aub"]
[{"$f":"IF('Directe werkingskosten'!T60=0, \"Geen vragen of bemerkingen\",'Directe werkingskosten'!T60)","v":"Geen vragen of bemerkingen"}]
["Gelieve hier te antwoorden of naam bijlage te vermelden en het vak naar lengte van het antwoord te vergroten  aub"]
[{"$f":"IF('Directe werkingskosten'!T61=0, \"Geen vragen of bemerkingen\",'Directe werkingskosten'!T61)","v":"Geen vragen of bemerkingen"}]
["Gelieve hier te antwoorden of naam bijlage te vermelden en het vak naar lengte van het antwoord te vergroten  aub"]
[{"$f":"IF('Directe werkingskosten'!T62=0, \"Geen vragen of bemerkingen\",'Directe werkingskosten'!T62)","v":"Geen vragen of bemerkingen"}]
["Gelieve hier te antwoorden of naam bijlage te vermelden en het vak naar lengte van het antwoord te vergroten  aub"]
[{"$f":"IF('Directe werkingskosten'!T63=0, \"Geen vragen of bemerkingen\",'Directe werkingskosten'!T63)","v":"Geen vragen of bemerkingen"}]
["Gelieve hier te antwoorden of naam bijlage te vermelden en het vak naar lengte van het antwoord te vergroten  aub"]
[{"$f":"IF('Directe werkingskosten'!T64=0, \"Geen vragen of bemerkingen\",'Directe werkingskosten'!T64)","v":"Geen vragen of bemerkingen"}]
["Gelieve hier te antwoorden of naam bijlage te vermelden en het vak naar lengte van het antwoord te vergroten  aub"]
[{"$f":"IF('Directe werkingskosten'!T65=0, \"Geen vragen of bemerkingen\",'Directe werkingskosten'!T65)","v":"Geen vragen of bemerkingen"}]
["Gelieve hier te antwoorden of naam bijlage te vermelden en het vak naar lengte van het antwoord te vergroten  aub"]
[{"$f":"IF('Directe werkingskosten'!T66=0, \"Geen vragen of bemerkingen\",'Directe werkingskosten'!T66)","v":"Geen vragen of bemerkingen"}]
["Gelieve hier te antwoorden of naam bijlage te vermelden en het vak naar lengte van het antwoord te vergroten  aub"]
[{"$f":"IF('Directe werkingskosten'!T67=0, \"Geen vragen of bemerkingen\",'Directe werkingskosten'!T67)","v":"Geen vragen of bemerkingen"}]
["Gelieve hier te antwoorden of naam bijlage te vermelden en het vak naar lengte van het antwoord te vergroten  aub"]
[{"$f":"IF('Directe werkingskosten'!T68=0, \"Geen vragen of bemerkingen\",'Directe werkingskosten'!T68)","v":"Geen vragen of bemerkingen"}]
["Gelieve hier te antwoorden of naam bijlage te vermelden en het vak naar lengte van het antwoord te vergroten  aub"]
[{"$f":"IF('Directe werkingskosten'!T69=0, \"Geen vragen of bemerkingen\",'Directe werkingskosten'!T69)","v":"Geen vragen of bemerkingen"}]
["Gelieve hier te antwoorden of naam bijlage te vermelden en het vak naar lengte van het antwoord te vergroten  aub"]
[{"$f":"IF('Directe werkingskosten'!T70=0, \"Geen vragen of bemerkingen\",'Directe werkingskosten'!T70)","v":"Geen vragen of bemerkingen"}]
["Gelieve hier te antwoorden of naam bijlage te vermelden en het vak naar lengte van het antwoord te vergroten  aub"]
[]
[{"$f":"'Directe werkingskosten'!D71","v":"Kies uit lijst Directe Werkingskosten "}]
[]
[{"$f":"IF('Directe werkingskosten'!T71=0, \"Geen vragen of bemerkingen\",'Directe werkingskosten'!T71)","v":"Geen vragen of bemerkingen"}]
["Gelieve hier te antwoorden of naam bijlage te vermelden en het vak naar lengte van het antwoord te vergroten  aub"]
[{"$f":"IF('Directe werkingskosten'!T72=0, \"Geen vragen of bemerkingen\",'Directe werkingskosten'!T72)","v":"Geen vragen of bemerkingen"}]
["Gelieve hier te antwoorden of naam bijlage te vermelden en het vak naar lengte van het antwoord te vergroten  aub"]
[{"$f":"IF('Directe werkingskosten'!T73=0, \"Geen vragen of bemerkingen\",'Directe werkingskosten'!T73)","v":"Geen vragen of bemerkingen"}]
["Gelieve hier te antwoorden of naam bijlage te vermelden en het vak naar lengte van het antwoord te vergroten  aub"]
[{"$f":"IF('Directe werkingskosten'!T74=0, \"Geen vragen of bemerkingen\",'Directe werkingskosten'!T74)","v":"Geen vragen of bemerkingen"}]
["Gelieve hier te antwoorden of naam bijlage te vermelden en het vak naar lengte van het antwoord te vergroten  aub"]
[{"$f":"IF('Directe werkingskosten'!T75=0, \"Geen vragen of bemerkingen\",'Directe werkingskosten'!T75)","v":"Geen vragen of bemerkingen"}]
["Gelieve hier te antwoorden of naam bijlage te vermelden en het vak naar lengte van het antwoord te vergroten  aub"]
[{"$f":"IF('Directe werkingskosten'!T76=0, \"Geen vragen of bemerkingen\",'Directe werkingskosten'!T76)","v":"Geen vragen of bemerkingen"}]
["Gelieve hier te antwoorden of naam bijlage te vermelden en het vak naar lengte van het antwoord te vergroten  aub"]
[{"$f":"IF('Directe werkingskosten'!T77=0, \"Geen vragen of bemerkingen\",'Directe werkingskosten'!T77)","v":"Geen vragen of bemerkingen"}]
["Gelieve hier te antwoorden of naam bijlage te vermelden en het vak naar lengte van het antwoord te vergroten  aub"]
[{"$f":"IF('Directe werkingskosten'!T78=0, \"Geen vragen of bemerkingen\",'Directe werkingskosten'!T78)","v":"Geen vragen of bemerkingen"}]
["Gelieve hier te antwoorden of naam bijlage te vermelden en het vak naar lengte van het antwoord te vergroten  aub"]
[{"$f":"IF('Directe werkingskosten'!T79=0, \"Geen vragen of bemerkingen\",'Directe werkingskosten'!T79)","v":"Geen vragen of bemerkingen"}]
["Gelieve hier te antwoorden of naam bijlage te vermelden en het vak naar lengte van het antwoord te vergroten  aub"]
[{"$f":"IF('Directe werkingskosten'!T80=0, \"Geen vragen of bemerkingen\",'Directe werkingskosten'!T80)","v":"Geen vragen of bemerkingen"}]
["Gelieve hier te antwoorden of naam bijlage te vermelden en het vak naar lengte van het antwoord te vergroten  aub"]
[{"$f":"IF('Directe werkingskosten'!T81=0, \"Geen vragen of bemerkingen\",'Directe werkingskosten'!T81)","v":"Geen vragen of bemerkingen"}]
["Gelieve hier te antwoorden of naam bijlage te vermelden en het vak naar lengte van het antwoord te vergroten  aub"]
[{"$f":"IF('Directe werkingskosten'!T82=0, \"Geen vragen of bemerkingen\",'Directe werkingskosten'!T82)","v":"Geen vragen of bemerkingen"}]
["Gelieve hier te antwoorden of naam bijlage te vermelden en het vak naar lengte van het antwoord te vergroten  aub"]
[{"$f":"IF('Directe werkingskosten'!T83=0, \"Geen vragen of bemerkingen\",'Directe werkingskosten'!T83)","v":"Geen vragen of bemerkingen"}]
["Gelieve hier te antwoorden of naam bijlage te vermelden en het vak naar lengte van het antwoord te vergroten  aub"]
[]
[{"$f":"'Directe werkingskosten'!D84","v":"Kies uit lijst Directe Werkingskosten "}]
[]
[{"$f":"IF('Directe werkingskosten'!T84=0, \"Geen vragen of bemerkingen\",'Directe werkingskosten'!T84)","v":"Geen vragen of bemerkingen"}]
["Gelieve hier te antwoorden of naam bijlage te vermelden en het vak naar lengte van het antwoord te vergroten  aub"]
[{"$f":"IF('Directe werkingskosten'!T85=0, \"Geen vragen of bemerkingen\",'Directe werkingskosten'!T85)","v":"Geen vragen of bemerkingen"}]
["Gelieve hier te antwoorden of naam bijlage te vermelden en het vak naar lengte van het antwoord te vergroten  aub"]
[{"$f":"IF('Directe werkingskosten'!T86=0, \"Geen vragen of bemerkingen\",'Directe werkingskosten'!T86)","v":"Geen vragen of bemerkingen"}]
["Gelieve hier te antwoorden of naam bijlage te vermelden en het vak naar lengte van het antwoord te vergroten  aub"]
[{"$f":"IF('Directe werkingskosten'!T87=0, \"Geen vragen of bemerkingen\",'Directe werkingskosten'!T87)","v":"Geen vragen of bemerkingen"}]
["Gelieve hier te antwoorden of naam bijlage te vermelden en het vak naar lengte van het antwoord te vergroten  aub"]
[{"$f":"IF('Directe werkingskosten'!T88=0, \"Geen vragen of bemerkingen\",'Directe werkingskosten'!T88)","v":"Geen vragen of bemerkingen"}]
["Gelieve hier te antwoorden of naam bijlage te vermelden en het vak naar lengte van het antwoord te vergroten  aub"]
[{"$f":"IF('Directe werkingskosten'!T89=0, \"Geen vragen of bemerkingen\",'Directe werkingskosten'!T89)","v":"Geen vragen of bemerkingen"}]
["Gelieve hier te antwoorden of naam bijlage te vermelden en het vak naar lengte van het antwoord te vergroten  aub"]
[{"$f":"IF('Directe werkingskosten'!T90=0, \"Geen vragen of bemerkingen\",'Directe werkingskosten'!T90)","v":"Geen vragen of bemerkingen"}]
["Gelieve hier te antwoorden of naam bijlage te vermelden en het vak naar lengte van het antwoord te vergroten  aub"]
[{"$f":"IF('Directe werkingskosten'!T91=0, \"Geen vragen of bemerkingen\",'Directe werkingskosten'!T91)","v":"Geen vragen of bemerkingen"}]
["Gelieve hier te antwoorden of naam bijlage te vermelden en het vak naar lengte van het antwoord te vergroten  aub"]
[{"$f":"IF('Directe werkingskosten'!T92=0, \"Geen vragen of bemerkingen\",'Directe werkingskosten'!T92)","v":"Geen vragen of bemerkingen"}]
["Gelieve hier te antwoorden of naam bijlage te vermelden en het vak naar lengte van het antwoord te vergroten  aub"]
[{"$f":"IF('Directe werkingskosten'!T93=0, \"Geen vragen of bemerkingen\",'Directe werkingskosten'!T93)","v":"Geen vragen of bemerkingen"}]
["Gelieve hier te antwoorden of naam bijlage te vermelden en het vak naar lengte van het antwoord te vergroten  aub"]
[{"$f":"IF('Directe werkingskosten'!T94=0, \"Geen vragen of bemerkingen\",'Directe werkingskosten'!T94)","v":"Geen vragen of bemerkingen"}]
["Gelieve hier te antwoorden of naam bijlage te vermelden en het vak naar lengte van het antwoord te vergroten  aub"]
[{"$f":"IF('Directe werkingskosten'!T95=0, \"Geen vragen of bemerkingen\",'Directe werkingskosten'!T95)","v":"Geen vragen of bemerkingen"}]
["Gelieve hier te antwoorden of naam bijlage te vermelden en het vak naar lengte van het antwoord te vergroten  aub"]
[{"$f":"IF('Directe werkingskosten'!T96=0, \"Geen vragen of bemerkingen\",'Directe werkingskosten'!T96)","v":"Geen vragen of bemerkingen"}]
["Gelieve hier te antwoorden of naam bijlage te vermelden en het vak naar lengte van het antwoord te vergroten  aub"]
[]
[{"$f":"'Directe werkingskosten'!D97","v":"Kies uit lijst Directe Werkingskosten "}]
[]
[{"$f":"IF('Directe werkingskosten'!T97=0, \"Geen vragen of bemerkingen\",'Directe werkingskosten'!T97)","v":"Geen vragen of bemerkingen"}]
["Gelieve hier te antwoorden of naam bijlage te vermelden en het vak naar lengte van het antwoord te vergroten  aub"]
[{"$f":"IF('Directe werkingskosten'!T98=0, \"Geen vragen of bemerkingen\",'Directe werkingskosten'!T98)","v":"Geen vragen of bemerkingen"}]
["Gelieve hier te antwoorden of naam bijlage te vermelden en het vak naar lengte van het antwoord te vergroten  aub"]
[{"$f":"IF('Directe werkingskosten'!T99=0, \"Geen vragen of bemerkingen\",'Directe werkingskosten'!T99)","v":"Geen vragen of bemerkingen"}]
["Gelieve hier te antwoorden of naam bijlage te vermelden en het vak naar lengte van het antwoord te vergroten  aub"]
[{"$f":"IF('Directe werkingskosten'!T100=0, \"Geen vragen of bemerkingen\",'Directe werkingskosten'!T100)","v":"Geen vragen of bemerkingen"}]
["Gelieve hier te antwoorden of naam bijlage te vermelden en het vak naar lengte van het antwoord te vergroten  aub"]
[{"$f":"IF('Directe werkingskosten'!T101=0, \"Geen vragen of bemerkingen\",'Directe werkingskosten'!T101)","v":"Geen vragen of bemerkingen"}]
["Gelieve hier te antwoorden of naam bijlage te vermelden en het vak naar lengte van het antwoord te vergroten  aub"]
[{"$f":"IF('Directe werkingskosten'!T102=0, \"Geen vragen of bemerkingen\",'Directe werkingskosten'!T102)","v":"Geen vragen of bemerkingen"}]
["Gelieve hier te antwoorden of naam bijlage te vermelden en het vak naar lengte van het antwoord te vergroten  aub"]
[{"$f":"IF('Directe werkingskosten'!T103=0, \"Geen vragen of bemerkingen\",'Directe werkingskosten'!T103)","v":"Geen vragen of bemerkingen"}]
["Gelieve hier te antwoorden of naam bijlage te vermelden en het vak naar lengte van het antwoord te vergroten  aub"]
[{"$f":"IF('Directe werkingskosten'!T104=0, \"Geen vragen of bemerkingen\",'Directe werkingskosten'!T104)","v":"Geen vragen of bemerkingen"}]
["Gelieve hier te antwoorden of naam bijlage te vermelden en het vak naar lengte van het antwoord te vergroten  aub"]
[{"$f":"IF('Directe werkingskosten'!T105=0, \"Geen vragen of bemerkingen\",'Directe werkingskosten'!T105)","v":"Geen vragen of bemerkingen"}]
["Gelieve hier te antwoorden of naam bijlage te vermelden en het vak naar lengte van het antwoord te vergroten  aub"]
[{"$f":"IF('Directe werkingskosten'!T106=0, \"Geen vragen of bemerkingen\",'Directe werkingskosten'!T106)","v":"Geen vragen of bemerkingen"}]
["Gelieve hier te antwoorden of naam bijlage te vermelden en het vak naar lengte van het antwoord te vergroten  aub"]
[{"$f":"IF('Directe werkingskosten'!T107=0, \"Geen vragen of bemerkingen\",'Directe werkingskosten'!T107)","v":"Geen vragen of bemerkingen"}]
["Gelieve hier te antwoorden of naam bijlage te vermelden en het vak naar lengte van het antwoord te vergroten  aub"]
[{"$f":"IF('Directe werkingskosten'!T108=0, \"Geen vragen of bemerkingen\",'Directe werkingskosten'!T108)","v":"Geen vragen of bemerkingen"}]
["Gelieve hier te antwoorden of naam bijlage te vermelden en het vak naar lengte van het antwoord te vergroten  aub"]
[{"$f":"IF('Directe werkingskosten'!T109=0, \"Geen vragen of bemerkingen\",'Directe werkingskosten'!T109)","v":"Geen vragen of bemerkingen"}]
["Gelieve hier te antwoorden of naam bijlage te vermelden en het vak naar lengte van het antwoord te vergroten  aub"]
[]
[{"$f":"'Directe werkingskosten'!D110","v":"Kies uit lijst Directe Werkingskosten "}]
[]
[{"$f":"IF('Directe werkingskosten'!T110=0, \"Geen vragen of bemerkingen\",'Directe werkingskosten'!T110)","v":"Geen vragen of bemerkingen"}]
["Gelieve hier te antwoorden of naam bijlage te vermelden en het vak naar lengte van het antwoord te vergroten  aub"]
[{"$f":"IF('Directe werkingskosten'!T111=0, \"Geen vragen of bemerkingen\",'Directe werkingskosten'!T111)","v":"Geen vragen of bemerkingen"}]
["Gelieve hier te antwoorden of naam bijlage te vermelden en het vak naar lengte van het antwoord te vergroten  aub"]
[{"$f":"IF('Directe werkingskosten'!T112=0, \"Geen vragen of bemerkingen\",'Directe werkingskosten'!T112)","v":"Geen vragen of bemerkingen"}]
["Gelieve hier te antwoorden of naam bijlage te vermelden en het vak naar lengte van het antwoord te vergroten  aub"]
[{"$f":"IF('Directe werkingskosten'!T113=0, \"Geen vragen of bemerkingen\",'Directe werkingskosten'!T113)","v":"Geen vragen of bemerkingen"}]
["Gelieve hier te antwoorden of naam bijlage te vermelden en het vak naar lengte van het antwoord te vergroten  aub"]
[{"$f":"IF('Directe werkingskosten'!T114=0, \"Geen vragen of bemerkingen\",'Directe werkingskosten'!T114)","v":"Geen vragen of bemerkingen"}]
["Gelieve hier te antwoorden of naam bijlage te vermelden en het vak naar lengte van het antwoord te vergroten  aub"]
[{"$f":"IF('Directe werkingskosten'!T115=0, \"Geen vragen of bemerkingen\",'Directe werkingskosten'!T115)","v":"Geen vragen of bemerkingen"}]
["Gelieve hier te antwoorden of naam bijlage te vermelden en het vak naar lengte van het antwoord te vergroten  aub"]
[{"$f":"IF('Directe werkingskosten'!T116=0, \"Geen vragen of bemerkingen\",'Directe werkingskosten'!T116)","v":"Geen vragen of bemerkingen"}]
["Gelieve hier te antwoorden of naam bijlage te vermelden en het vak naar lengte van het antwoord te vergroten  aub"]
[{"$f":"IF('Directe werkingskosten'!T117=0, \"Geen vragen of bemerkingen\",'Directe werkingskosten'!T117)","v":"Geen vragen of bemerkingen"}]
["Gelieve hier te antwoorden of naam bijlage te vermelden en het vak naar lengte van het antwoord te vergroten  aub"]
[{"$f":"IF('Directe werkingskosten'!T118=0, \"Geen vragen of bemerkingen\",'Directe werkingskosten'!T118)","v":"Geen vragen of bemerkingen"}]
["Gelieve hier te antwoorden of naam bijlage te vermelden en het vak naar lengte van het antwoord te vergroten  aub"]
[{"$f":"IF('Directe werkingskosten'!T119=0, \"Geen vragen of bemerkingen\",'Directe werkingskosten'!T119)","v":"Geen vragen of bemerkingen"}]
["Gelieve hier te antwoorden of naam bijlage te vermelden en het vak naar lengte van het antwoord te vergroten  aub"]
[{"$f":"IF('Directe werkingskosten'!T120=0, \"Geen vragen of bemerkingen\",'Directe werkingskosten'!T120)","v":"Geen vragen of bemerkingen"}]
["Gelieve hier te antwoorden of naam bijlage te vermelden en het vak naar lengte van het antwoord te vergroten  aub"]
[{"$f":"IF('Directe werkingskosten'!T121=0, \"Geen vragen of bemerkingen\",'Directe werkingskosten'!T121)","v":"Geen vragen of bemerkingen"}]
["Gelieve hier te antwoorden of naam bijlage te vermelden en het vak naar lengte van het antwoord te vergroten  aub"]
[{"$f":"IF('Directe werkingskosten'!T122=0, \"Geen vragen of bemerkingen\",'Directe werkingskosten'!T122)","v":"Geen vragen of bemerkingen"}]
["Gelieve hier te antwoorden of naam bijlage te vermelden en het vak naar lengte van het antwoord te vergroten  aub"]
[]
[{"$f":"'Directe werkingskosten'!D123","v":"Andere: (zelf in te vullen) "}]
[]
[{"$f":"IF('Directe werkingskosten'!T123=0, \"Geen vragen of bemerkingen\",'Directe werkingskosten'!T123)","v":"Geen vragen of bemerkingen"}]
["Gelieve hier te antwoorden of naam bijlage te vermelden en het vak naar lengte van het antwoord te vergroten  aub"]
[{"$f":"IF('Directe werkingskosten'!T124=0, \"Geen vragen of bemerkingen\",'Directe werkingskosten'!T124)","v":"Geen vragen of bemerkingen"}]
["Gelieve hier te antwoorden of naam bijlage te vermelden en het vak naar lengte van het antwoord te vergroten  aub"]
[{"$f":"IF('Directe werkingskosten'!T125=0, \"Geen vragen of bemerkingen\",'Directe werkingskosten'!T125)","v":"Geen vragen of bemerkingen"}]
["Gelieve hier te antwoorden of naam bijlage te vermelden en het vak naar lengte van het antwoord te vergroten  aub"]
[{"$f":"IF('Directe werkingskosten'!T126=0, \"Geen vragen of bemerkingen\",'Directe werkingskosten'!T126)","v":"Geen vragen of bemerkingen"}]
["Gelieve hier te antwoorden of naam bijlage te vermelden en het vak naar lengte van het antwoord te vergroten  aub"]
[{"$f":"IF('Directe werkingskosten'!T127=0, \"Geen vragen of bemerkingen\",'Directe werkingskosten'!T127)","v":"Geen vragen of bemerkingen"}]
["Gelieve hier te antwoorden of naam bijlage te vermelden en het vak naar lengte van het antwoord te vergroten  aub"]
[{"$f":"IF('Directe werkingskosten'!T128=0, \"Geen vragen of bemerkingen\",'Directe werkingskosten'!T128)","v":"Geen vragen of bemerkingen"}]
["Gelieve hier te antwoorden of naam bijlage te vermelden en het vak naar lengte van het antwoord te vergroten  aub"]
[{"$f":"IF('Directe werkingskosten'!T129=0, \"Geen vragen of bemerkingen\",'Directe werkingskosten'!T129)","v":"Geen vragen of bemerkingen"}]
["Gelieve hier te antwoorden of naam bijlage te vermelden en het vak naar lengte van het antwoord te vergroten  aub"]
[{"$f":"IF('Directe werkingskosten'!T130=0, \"Geen vragen of bemerkingen\",'Directe werkingskosten'!T130)","v":"Geen vragen of bemerkingen"}]
["Gelieve hier te antwoorden of naam bijlage te vermelden en het vak naar lengte van het antwoord te vergroten  aub"]
[{"$f":"IF('Directe werkingskosten'!T131=0, \"Geen vragen of bemerkingen\",'Directe werkingskosten'!T131)","v":"Geen vragen of bemerkingen"}]
["Gelieve hier te antwoorden of naam bijlage te vermelden en het vak naar lengte van het antwoord te vergroten  aub"]
[{"$f":"IF('Directe werkingskosten'!T132=0, \"Geen vragen of bemerkingen\",'Directe werkingskosten'!T132)","v":"Geen vragen of bemerkingen"}]
["Gelieve hier te antwoorden of naam bijlage te vermelden en het vak naar lengte van het antwoord te vergroten  aub"]
[{"$f":"IF('Directe werkingskosten'!T133=0, \"Geen vragen of bemerkingen\",'Directe werkingskosten'!T133)","v":"Geen vragen of bemerkingen"}]
["Gelieve hier te antwoorden of naam bijlage te vermelden en het vak naar lengte van het antwoord te vergroten  aub"]
[{"$f":"IF('Directe werkingskosten'!T134=0, \"Geen vragen of bemerkingen\",'Directe werkingskosten'!T134)","v":"Geen vragen of bemerkingen"}]
["Gelieve hier te antwoorden of naam bijlage te vermelden en het vak naar lengte van het antwoord te vergroten  aub"]
[{"$f":"IF('Directe werkingskosten'!T135=0, \"Geen vragen of bemerkingen\",'Directe werkingskosten'!T135)","v":"Geen vragen of bemerkingen"}]
["Gelieve hier te antwoorden of naam bijlage te vermelden en het vak naar lengte van het antwoord te vergroten  aub"]
[]
[{"$f":"'Directe werkingskosten'!D136","v":"Andere: (zelf in te vullen) "}]
[]
[{"$f":"IF('Directe werkingskosten'!T136=0, \"Geen vragen of bemerkingen\",'Directe werkingskosten'!T136)","v":"Geen vragen of bemerkingen"}]
["Gelieve hier te antwoorden of naam bijlage te vermelden en het vak naar lengte van het antwoord te vergroten  aub"]
[{"$f":"IF('Directe werkingskosten'!T137=0, \"Geen vragen of bemerkingen\",'Directe werkingskosten'!T137)","v":"Geen vragen of bemerkingen"}]
["Gelieve hier te antwoorden of naam bijlage te vermelden en het vak naar lengte van het antwoord te vergroten  aub"]
[{"$f":"IF('Directe werkingskosten'!T138=0, \"Geen vragen of bemerkingen\",'Directe werkingskosten'!T138)","v":"Geen vragen of bemerkingen"}]
["Gelieve hier te antwoorden of naam bijlage te vermelden en het vak naar lengte van het antwoord te vergroten  aub"]
[{"$f":"IF('Directe werkingskosten'!T139=0, \"Geen vragen of bemerkingen\",'Directe werkingskosten'!T139)","v":"Geen vragen of bemerkingen"}]
["Gelieve hier te antwoorden of naam bijlage te vermelden en het vak naar lengte van het antwoord te vergroten  aub"]
[{"$f":"IF('Directe werkingskosten'!T140=0, \"Geen vragen of bemerkingen\",'Directe werkingskosten'!T140)","v":"Geen vragen of bemerkingen"}]
["Gelieve hier te antwoorden of naam bijlage te vermelden en het vak naar lengte van het antwoord te vergroten  aub"]
[{"$f":"IF('Directe werkingskosten'!T141=0, \"Geen vragen of bemerkingen\",'Directe werkingskosten'!T141)","v":"Geen vragen of bemerkingen"}]
["Gelieve hier te antwoorden of naam bijlage te vermelden en het vak naar lengte van het antwoord te vergroten  aub"]
[{"$f":"IF('Directe werkingskosten'!T142=0, \"Geen vragen of bemerkingen\",'Directe werkingskosten'!T142)","v":"Geen vragen of bemerkingen"}]
["Gelieve hier te antwoorden of naam bijlage te vermelden en het vak naar lengte van het antwoord te vergroten  aub"]
[{"$f":"IF('Directe werkingskosten'!T143=0, \"Geen vragen of bemerkingen\",'Directe werkingskosten'!T143)","v":"Geen vragen of bemerkingen"}]
["Gelieve hier te antwoorden of naam bijlage te vermelden en het vak naar lengte van het antwoord te vergroten  aub"]
[{"$f":"IF('Directe werkingskosten'!T144=0, \"Geen vragen of bemerkingen\",'Directe werkingskosten'!T144)","v":"Geen vragen of bemerkingen"}]
["Gelieve hier te antwoorden of naam bijlage te vermelden en het vak naar lengte van het antwoord te vergroten  aub"]
[{"$f":"IF('Directe werkingskosten'!T145=0, \"Geen vragen of bemerkingen\",'Directe werkingskosten'!T145)","v":"Geen vragen of bemerkingen"}]
["Gelieve hier te antwoorden of naam bijlage te vermelden en het vak naar lengte van het antwoord te vergroten  aub"]
[{"$f":"IF('Directe werkingskosten'!T146=0, \"Geen vragen of bemerkingen\",'Directe werkingskosten'!T146)","v":"Geen vragen of bemerkingen"}]
["Gelieve hier te antwoorden of naam bijlage te vermelden en het vak naar lengte van het antwoord te vergroten  aub"]
[{"$f":"IF('Directe werkingskosten'!T147=0, \"Geen vragen of bemerkingen\",'Directe werkingskosten'!T147)","v":"Geen vragen of bemerkingen"}]
["Gelieve hier te antwoorden of naam bijlage te vermelden en het vak naar lengte van het antwoord te vergroten  aub"]
[{"$f":"IF('Directe werkingskosten'!T148=0, \"Geen vragen of bemerkingen\",'Directe werkingskosten'!T148)","v":"Geen vragen of bemerkingen"}]
["Gelieve hier te antwoorden of naam bijlage te vermelden en het vak naar lengte van het antwoord te vergroten  aub"]
[{"$f":"IF('Directe werkingskosten'!T149=0, \"Geen vragen of bemerkingen\",'Directe werkingskosten'!T149)","v":"Geen vragen of bemerkingen"}]
["Gelieve hier te antwoorden of naam bijlage te vermelden en het vak naar lengte van het antwoord te vergroten  aub"]
[]
["ANDERE WERKINGSKOSTEN:"]
[]
[{"$f":"'Indirecte werkingskosten'!D6","v":"Kies uit lijst Indirecte Werkingskosten"}]
[]
[{"$f":"IF('Indirecte werkingskosten'!P6=0, \"Geen vragen of bemerkingen\",'Indirecte werkingskosten'!P6)","v":"Geen vragen of bemerkingen"}]
["Gelieve hier te antwoorden of naam bijlage te vermelden en het vak naar lengte van het antwoord te vergroten  aub"]
[{"$f":"IF('Indirecte werkingskosten'!P7=0, \"Geen vragen of bemerkingen\",'Indirecte werkingskosten'!P7)","v":"Geen vragen of bemerkingen"}]
["Gelieve hier te antwoorden of naam bijlage te vermelden en het vak naar lengte van het antwoord te vergroten  aub"]
[{"$f":"IF('Indirecte werkingskosten'!P8=0, \"Geen vragen of bemerkingen\",'Indirecte werkingskosten'!P8)","v":"Geen vragen of bemerkingen"}]
["Gelieve hier te antwoorden of naam bijlage te vermelden en het vak naar lengte van het antwoord te vergroten  aub"]
[{"$f":"IF('Indirecte werkingskosten'!P9=0, \"Geen vragen of bemerkingen\",'Indirecte werkingskosten'!P9)","v":"Geen vragen of bemerkingen"}]
["Gelieve hier te antwoorden of naam bijlage te vermelden en het vak naar lengte van het antwoord te vergroten  aub"]
[{"$f":"IF('Indirecte werkingskosten'!P10=0, \"Geen vragen of bemerkingen\",'Indirecte werkingskosten'!P10)","v":"Geen vragen of bemerkingen"}]
["Gelieve hier te antwoorden of naam bijlage te vermelden en het vak naar lengte van het antwoord te vergroten  aub"]
[{"$f":"IF('Indirecte werkingskosten'!P11=0, \"Geen vragen of bemerkingen\",'Indirecte werkingskosten'!P11)","v":"Geen vragen of bemerkingen"}]
["Gelieve hier te antwoorden of naam bijlage te vermelden en het vak naar lengte van het antwoord te vergroten  aub"]
[{"$f":"IF('Indirecte werkingskosten'!P12=0, \"Geen vragen of bemerkingen\",'Indirecte werkingskosten'!P12)","v":"Geen vragen of bemerkingen"}]
["Gelieve hier te antwoorden of naam bijlage te vermelden en het vak naar lengte van het antwoord te vergroten  aub"]
[{"$f":"IF('Indirecte werkingskosten'!P13=0, \"Geen vragen of bemerkingen\",'Indirecte werkingskosten'!P13)","v":"Geen vragen of bemerkingen"}]
["Gelieve hier te antwoorden of naam bijlage te vermelden en het vak naar lengte van het antwoord te vergroten  aub"]
[{"$f":"IF('Indirecte werkingskosten'!P14=0, \"Geen vragen of bemerkingen\",'Indirecte werkingskosten'!P14)","v":"Geen vragen of bemerkingen"}]
["Gelieve hier te antwoorden of naam bijlage te vermelden en het vak naar lengte van het antwoord te vergroten  aub"]
[{"$f":"IF('Indirecte werkingskosten'!P15=0, \"Geen vragen of bemerkingen\",'Indirecte werkingskosten'!P15)","v":"Geen vragen of bemerkingen"}]
["Gelieve hier te antwoorden of naam bijlage te vermelden en het vak naar lengte van het antwoord te vergroten  aub"]
[{"$f":"IF('Indirecte werkingskosten'!P16=0, \"Geen vragen of bemerkingen\",'Indirecte werkingskosten'!P16)","v":"Geen vragen of bemerkingen"}]
["Gelieve hier te antwoorden of naam bijlage te vermelden en het vak naar lengte van het antwoord te vergroten  aub"]
[{"$f":"IF('Indirecte werkingskosten'!P17=0, \"Geen vragen of bemerkingen\",'Indirecte werkingskosten'!P17)","v":"Geen vragen of bemerkingen"}]
["Gelieve hier te antwoorden of naam bijlage te vermelden en het vak naar lengte van het antwoord te vergroten  aub"]
[{"$f":"IF('Indirecte werkingskosten'!P18=0, \"Geen vragen of bemerkingen\",'Indirecte werkingskosten'!P18)","v":"Geen vragen of bemerkingen"}]
["Gelieve hier te antwoorden of naam bijlage te vermelden en het vak naar lengte van het antwoord te vergroten  aub"]
[]
[{"$f":"'Indirecte werkingskosten'!D19","v":"Kies uit lijst Indirecte Werkingskosten"}]
[]
[{"$f":"IF('Indirecte werkingskosten'!P19=0, \"Geen vragen of bemerkingen\",'Indirecte werkingskosten'!P19)","v":"Geen vragen of bemerkingen"}]
["Gelieve hier te antwoorden of naam bijlage te vermelden en het vak naar lengte van het antwoord te vergroten  aub"]
[{"$f":"IF('Indirecte werkingskosten'!P20=0, \"Geen vragen of bemerkingen\",'Indirecte werkingskosten'!P20)","v":"Geen vragen of bemerkingen"}]
["Gelieve hier te antwoorden of naam bijlage te vermelden en het vak naar lengte van het antwoord te vergroten  aub"]
[{"$f":"IF('Indirecte werkingskosten'!P21=0, \"Geen vragen of bemerkingen\",'Indirecte werkingskosten'!P21)","v":"Geen vragen of bemerkingen"}]
["Gelieve hier te antwoorden of naam bijlage te vermelden en het vak naar lengte van het antwoord te vergroten  aub"]
[{"$f":"IF('Indirecte werkingskosten'!P22=0, \"Geen vragen of bemerkingen\",'Indirecte werkingskosten'!P22)","v":"Geen vragen of bemerkingen"}]
["Gelieve hier te antwoorden of naam bijlage te vermelden en het vak naar lengte van het antwoord te vergroten  aub"]
[{"$f":"IF('Indirecte werkingskosten'!P23=0, \"Geen vragen of bemerkingen\",'Indirecte werkingskosten'!P23)","v":"Geen vragen of bemerkingen"}]
["Gelieve hier te antwoorden of naam bijlage te vermelden en het vak naar lengte van het antwoord te vergroten  aub"]
[{"$f":"IF('Indirecte werkingskosten'!P24=0, \"Geen vragen of bemerkingen\",'Indirecte werkingskosten'!P24)","v":"Geen vragen of bemerkingen"}]
["Gelieve hier te antwoorden of naam bijlage te vermelden en het vak naar lengte van het antwoord te vergroten  aub"]
[{"$f":"IF('Indirecte werkingskosten'!P25=0, \"Geen vragen of bemerkingen\",'Indirecte werkingskosten'!P25)","v":"Geen vragen of bemerkingen"}]
["Gelieve hier te antwoorden of naam bijlage te vermelden en het vak naar lengte van het antwoord te vergroten  aub"]
[{"$f":"IF('Indirecte werkingskosten'!P26=0, \"Geen vragen of bemerkingen\",'Indirecte werkingskosten'!P26)","v":"Geen vragen of bemerkingen"}]
["Gelieve hier te antwoorden of naam bijlage te vermelden en het vak naar lengte van het antwoord te vergroten  aub"]
[{"$f":"IF('Indirecte werkingskosten'!P27=0, \"Geen vragen of bemerkingen\",'Indirecte werkingskosten'!P27)","v":"Geen vragen of bemerkingen"}]
["Gelieve hier te antwoorden of naam bijlage te vermelden en het vak naar lengte van het antwoord te vergroten  aub"]
[{"$f":"IF('Indirecte werkingskosten'!P28=0, \"Geen vragen of bemerkingen\",'Indirecte werkingskosten'!P28)","v":"Geen vragen of bemerkingen"}]
["Gelieve hier te antwoorden of naam bijlage te vermelden en het vak naar lengte van het antwoord te vergroten  aub"]
[{"$f":"IF('Indirecte werkingskosten'!P29=0, \"Geen vragen of bemerkingen\",'Indirecte werkingskosten'!P29)","v":"Geen vragen of bemerkingen"}]
["Gelieve hier te antwoorden of naam bijlage te vermelden en het vak naar lengte van het antwoord te vergroten  aub"]
[{"$f":"IF('Indirecte werkingskosten'!P30=0, \"Geen vragen of bemerkingen\",'Indirecte werkingskosten'!P30)","v":"Geen vragen of bemerkingen"}]
["Gelieve hier te antwoorden of naam bijlage te vermelden en het vak naar lengte van het antwoord te vergroten  aub"]
[{"$f":"IF('Indirecte werkingskosten'!P31=0, \"Geen vragen of bemerkingen\",'Indirecte werkingskosten'!P31)","v":"Geen vragen of bemerkingen"}]
["Gelieve hier te antwoorden of naam bijlage te vermelden en het vak naar lengte van het antwoord te vergroten  aub"]
[]
[{"$f":"'Indirecte werkingskosten'!D32","v":"Kies uit lijst Indirecte Werkingskosten"}]
[]
[{"$f":"IF('Indirecte werkingskosten'!P32=0, \"Geen vragen of bemerkingen\",'Indirecte werkingskosten'!P32)","v":"Geen vragen of bemerkingen"}]
["Gelieve hier te antwoorden of naam bijlage te vermelden en het vak naar lengte van het antwoord te vergroten  aub"]
[{"$f":"IF('Indirecte werkingskosten'!P33=0, \"Geen vragen of bemerkingen\",'Indirecte werkingskosten'!P33)","v":"Geen vragen of bemerkingen"}]
["Gelieve hier te antwoorden of naam bijlage te vermelden en het vak naar lengte van het antwoord te vergroten  aub"]
[{"$f":"IF('Indirecte werkingskosten'!P34=0, \"Geen vragen of bemerkingen\",'Indirecte werkingskosten'!P34)","v":"Geen vragen of bemerkingen"}]
["Gelieve hier te antwoorden of naam bijlage te vermelden en het vak naar lengte van het antwoord te vergroten  aub"]
[{"$f":"IF('Indirecte werkingskosten'!P35=0, \"Geen vragen of bemerkingen\",'Indirecte werkingskosten'!P35)","v":"Geen vragen of bemerkingen"}]
["Gelieve hier te antwoorden of naam bijlage te vermelden en het vak naar lengte van het antwoord te vergroten  aub"]
[{"$f":"IF('Indirecte werkingskosten'!P36=0, \"Geen vragen of bemerkingen\",'Indirecte werkingskosten'!P36)","v":"Geen vragen of bemerkingen"}]
["Gelieve hier te antwoorden of naam bijlage te vermelden en het vak naar lengte van het antwoord te vergroten  aub"]
[{"$f":"IF('Indirecte werkingskosten'!P37=0, \"Geen vragen of bemerkingen\",'Indirecte werkingskosten'!P37)","v":"Geen vragen of bemerkingen"}]
["Gelieve hier te antwoorden of naam bijlage te vermelden en het vak naar lengte van het antwoord te vergroten  aub"]
[{"$f":"IF('Indirecte werkingskosten'!P38=0, \"Geen vragen of bemerkingen\",'Indirecte werkingskosten'!P38)","v":"Geen vragen of bemerkingen"}]
["Gelieve hier te antwoorden of naam bijlage te vermelden en het vak naar lengte van het antwoord te vergroten  aub"]
[{"$f":"IF('Indirecte werkingskosten'!P39=0, \"Geen vragen of bemerkingen\",'Indirecte werkingskosten'!P39)","v":"Geen vragen of bemerkingen"}]
["Gelieve hier te antwoorden of naam bijlage te vermelden en het vak naar lengte van het antwoord te vergroten  aub"]
[{"$f":"IF('Indirecte werkingskosten'!P40=0, \"Geen vragen of bemerkingen\",'Indirecte werkingskosten'!P40)","v":"Geen vragen of bemerkingen"}]
["Gelieve hier te antwoorden of naam bijlage te vermelden en het vak naar lengte van het antwoord te vergroten  aub"]
[{"$f":"IF('Indirecte werkingskosten'!P41=0, \"Geen vragen of bemerkingen\",'Indirecte werkingskosten'!P41)","v":"Geen vragen of bemerkingen"}]
["Gelieve hier te antwoorden of naam bijlage te vermelden en het vak naar lengte van het antwoord te vergroten  aub"]
[{"$f":"IF('Indirecte werkingskosten'!P42=0, \"Geen vragen of bemerkingen\",'Indirecte werkingskosten'!P42)","v":"Geen vragen of bemerkingen"}]
["Gelieve hier te antwoorden of naam bijlage te vermelden en het vak naar lengte van het antwoord te vergroten  aub"]
[{"$f":"IF('Indirecte werkingskosten'!P43=0, \"Geen vragen of bemerkingen\",'Indirecte werkingskosten'!P43)","v":"Geen vragen of bemerkingen"}]
["Gelieve hier te antwoorden of naam bijlage te vermelden en het vak naar lengte van het antwoord te vergroten  aub"]
[{"$f":"IF('Indirecte werkingskosten'!P44=0, \"Geen vragen of bemerkingen\",'Indirecte werkingskosten'!P44)","v":"Geen vragen of bemerkingen"}]
["Gelieve hier te antwoorden of naam bijlage te vermelden en het vak naar lengte van het antwoord te vergroten  aub"]
[]
[{"$f":"'Indirecte werkingskosten'!D45","v":"Kies uit lijst Indirecte Werkingskosten"}]
[]
[{"$f":"IF('Indirecte werkingskosten'!P45=0, \"Geen vragen of bemerkingen\",'Indirecte werkingskosten'!P45)","v":"Geen vragen of bemerkingen"}]
["Gelieve hier te antwoorden of naam bijlage te vermelden en het vak naar lengte van het antwoord te vergroten  aub"]
[{"$f":"IF('Indirecte werkingskosten'!P46=0, \"Geen vragen of bemerkingen\",'Indirecte werkingskosten'!P46)","v":"Geen vragen of bemerkingen"}]
["Gelieve hier te antwoorden of naam bijlage te vermelden en het vak naar lengte van het antwoord te vergroten  aub"]
[{"$f":"IF('Indirecte werkingskosten'!P47=0, \"Geen vragen of bemerkingen\",'Indirecte werkingskosten'!P47)","v":"Geen vragen of bemerkingen"}]
["Gelieve hier te antwoorden of naam bijlage te vermelden en het vak naar lengte van het antwoord te vergroten  aub"]
[{"$f":"IF('Indirecte werkingskosten'!P48=0, \"Geen vragen of bemerkingen\",'Indirecte werkingskosten'!P48)","v":"Geen vragen of bemerkingen"}]
["Gelieve hier te antwoorden of naam bijlage te vermelden en het vak naar lengte van het antwoord te vergroten  aub"]
[{"$f":"IF('Indirecte werkingskosten'!P49=0, \"Geen vragen of bemerkingen\",'Indirecte werkingskosten'!P49)","v":"Geen vragen of bemerkingen"}]
["Gelieve hier te antwoorden of naam bijlage te vermelden en het vak naar lengte van het antwoord te vergroten  aub"]
[{"$f":"IF('Indirecte werkingskosten'!P50=0, \"Geen vragen of bemerkingen\",'Indirecte werkingskosten'!P50)","v":"Geen vragen of bemerkingen"}]
["Gelieve hier te antwoorden of naam bijlage te vermelden en het vak naar lengte van het antwoord te vergroten  aub"]
[{"$f":"IF('Indirecte werkingskosten'!P51=0, \"Geen vragen of bemerkingen\",'Indirecte werkingskosten'!P51)","v":"Geen vragen of bemerkingen"}]
["Gelieve hier te antwoorden of naam bijlage te vermelden en het vak naar lengte van het antwoord te vergroten  aub"]
[{"$f":"IF('Indirecte werkingskosten'!P52=0, \"Geen vragen of bemerkingen\",'Indirecte werkingskosten'!P52)","v":"Geen vragen of bemerkingen"}]
["Gelieve hier te antwoorden of naam bijlage te vermelden en het vak naar lengte van het antwoord te vergroten  aub"]
[{"$f":"IF('Indirecte werkingskosten'!P53=0, \"Geen vragen of bemerkingen\",'Indirecte werkingskosten'!P53)","v":"Geen vragen of bemerkingen"}]
["Gelieve hier te antwoorden of naam bijlage te vermelden en het vak naar lengte van het antwoord te vergroten  aub"]
[{"$f":"IF('Indirecte werkingskosten'!P54=0, \"Geen vragen of bemerkingen\",'Indirecte werkingskosten'!P54)","v":"Geen vragen of bemerkingen"}]
["Gelieve hier te antwoorden of naam bijlage te vermelden en het vak naar lengte van het antwoord te vergroten  aub"]
[{"$f":"IF('Indirecte werkingskosten'!P55=0, \"Geen vragen of bemerkingen\",'Indirecte werkingskosten'!P55)","v":"Geen vragen of bemerkingen"}]
["Gelieve hier te antwoorden of naam bijlage te vermelden en het vak naar lengte van het antwoord te vergroten  aub"]
[{"$f":"IF('Indirecte werkingskosten'!P56=0, \"Geen vragen of bemerkingen\",'Indirecte werkingskosten'!P56)","v":"Geen vragen of bemerkingen"}]
["Gelieve hier te antwoorden of naam bijlage te vermelden en het vak naar lengte van het antwoord te vergroten  aub"]
[{"$f":"IF('Indirecte werkingskosten'!P57=0, \"Geen vragen of bemerkingen\",'Indirecte werkingskosten'!P57)","v":"Geen vragen of bemerkingen"}]
["Gelieve hier te antwoorden of naam bijlage te vermelden en het vak naar lengte van het antwoord te vergroten  aub"]
[]
[{"$f":"'Indirecte werkingskosten'!D58","v":"Kies uit lijst Indirecte Werkingskosten"}]
[]
[{"$f":"IF('Indirecte werkingskosten'!P58=0, \"Geen vragen of bemerkingen\",'Indirecte werkingskosten'!P58)","v":"Geen vragen of bemerkingen"}]
["Gelieve hier te antwoorden of naam bijlage te vermelden en het vak naar lengte van het antwoord te vergroten  aub"]
[{"$f":"IF('Indirecte werkingskosten'!P59=0, \"Geen vragen of bemerkingen\",'Indirecte werkingskosten'!P59)","v":"Geen vragen of bemerkingen"}]
["Gelieve hier te antwoorden of naam bijlage te vermelden en het vak naar lengte van het antwoord te vergroten  aub"]
[{"$f":"IF('Indirecte werkingskosten'!P60=0, \"Geen vragen of bemerkingen\",'Indirecte werkingskosten'!P60)","v":"Geen vragen of bemerkingen"}]
["Gelieve hier te antwoorden of naam bijlage te vermelden en het vak naar lengte van het antwoord te vergroten  aub"]
[{"$f":"IF('Indirecte werkingskosten'!P61=0, \"Geen vragen of bemerkingen\",'Indirecte werkingskosten'!P61)","v":"Geen vragen of bemerkingen"}]
["Gelieve hier te antwoorden of naam bijlage te vermelden en het vak naar lengte van het antwoord te vergroten  aub"]
[{"$f":"IF('Indirecte werkingskosten'!P62=0, \"Geen vragen of bemerkingen\",'Indirecte werkingskosten'!P62)","v":"Geen vragen of bemerkingen"}]
["Gelieve hier te antwoorden of naam bijlage te vermelden en het vak naar lengte van het antwoord te vergroten  aub"]
[{"$f":"IF('Indirecte werkingskosten'!P63=0, \"Geen vragen of bemerkingen\",'Indirecte werkingskosten'!P63)","v":"Geen vragen of bemerkingen"}]
["Gelieve hier te antwoorden of naam bijlage te vermelden en het vak naar lengte van het antwoord te vergroten  aub"]
[{"$f":"IF('Indirecte werkingskosten'!P64=0, \"Geen vragen of bemerkingen\",'Indirecte werkingskosten'!P64)","v":"Geen vragen of bemerkingen"}]
["Gelieve hier te antwoorden of naam bijlage te vermelden en het vak naar lengte van het antwoord te vergroten  aub"]
[{"$f":"IF('Indirecte werkingskosten'!P65=0, \"Geen vragen of bemerkingen\",'Indirecte werkingskosten'!P65)","v":"Geen vragen of bemerkingen"}]
["Gelieve hier te antwoorden of naam bijlage te vermelden en het vak naar lengte van het antwoord te vergroten  aub"]
[{"$f":"IF('Indirecte werkingskosten'!P66=0, \"Geen vragen of bemerkingen\",'Indirecte werkingskosten'!P66)","v":"Geen vragen of bemerkingen"}]
["Gelieve hier te antwoorden of naam bijlage te vermelden en het vak naar lengte van het antwoord te vergroten  aub"]
[{"$f":"IF('Indirecte werkingskosten'!P67=0, \"Geen vragen of bemerkingen\",'Indirecte werkingskosten'!P67)","v":"Geen vragen of bemerkingen"}]
["Gelieve hier te antwoorden of naam bijlage te vermelden en het vak naar lengte van het antwoord te vergroten  aub"]
[{"$f":"IF('Indirecte werkingskosten'!P68=0, \"Geen vragen of bemerkingen\",'Indirecte werkingskosten'!P68)","v":"Geen vragen of bemerkingen"}]
["Gelieve hier te antwoorden of naam bijlage te vermelden en het vak naar lengte van het antwoord te vergroten  aub"]
[{"$f":"IF('Indirecte werkingskosten'!P69=0, \"Geen vragen of bemerkingen\",'Indirecte werkingskosten'!P69)","v":"Geen vragen of bemerkingen"}]
["Gelieve hier te antwoorden of naam bijlage te vermelden en het vak naar lengte van het antwoord te vergroten  aub"]
[{"$f":"IF('Indirecte werkingskosten'!P70=0, \"Geen vragen of bemerkingen\",'Indirecte werkingskosten'!P70)","v":"Geen vragen of bemerkingen"}]
["Gelieve hier te antwoorden of naam bijlage te vermelden en het vak naar lengte van het antwoord te vergroten  aub"]
[]
[{"$f":"'Indirecte werkingskosten'!D71","v":"Kies uit lijst Indirecte Werkingskosten"}]
[]
[{"$f":"IF('Indirecte werkingskosten'!P71=0, \"Geen vragen of bemerkingen\",'Indirecte werkingskosten'!P71)","v":"Geen vragen of bemerkingen"}]
["Gelieve hier te antwoorden of naam bijlage te vermelden en het vak naar lengte van het antwoord te vergroten  aub"]
[{"$f":"IF('Indirecte werkingskosten'!P72=0, \"Geen vragen of bemerkingen\",'Indirecte werkingskosten'!P72)","v":"Geen vragen of bemerkingen"}]
["Gelieve hier te antwoorden of naam bijlage te vermelden en het vak naar lengte van het antwoord te vergroten  aub"]
[{"$f":"IF('Indirecte werkingskosten'!P73=0, \"Geen vragen of bemerkingen\",'Indirecte werkingskosten'!P73)","v":"Geen vragen of bemerkingen"}]
["Gelieve hier te antwoorden of naam bijlage te vermelden en het vak naar lengte van het antwoord te vergroten  aub"]
[{"$f":"IF('Indirecte werkingskosten'!P74=0, \"Geen vragen of bemerkingen\",'Indirecte werkingskosten'!P74)","v":"Geen vragen of bemerkingen"}]
["Gelieve hier te antwoorden of naam bijlage te vermelden en het vak naar lengte van het antwoord te vergroten  aub"]
[{"$f":"IF('Indirecte werkingskosten'!P75=0, \"Geen vragen of bemerkingen\",'Indirecte werkingskosten'!P75)","v":"Geen vragen of bemerkingen"}]
["Gelieve hier te antwoorden of naam bijlage te vermelden en het vak naar lengte van het antwoord te vergroten  aub"]
[{"$f":"IF('Indirecte werkingskosten'!P76=0, \"Geen vragen of bemerkingen\",'Indirecte werkingskosten'!P76)","v":"Geen vragen of bemerkingen"}]
["Gelieve hier te antwoorden of naam bijlage te vermelden en het vak naar lengte van het antwoord te vergroten  aub"]
[{"$f":"IF('Indirecte werkingskosten'!P77=0, \"Geen vragen of bemerkingen\",'Indirecte werkingskosten'!P77)","v":"Geen vragen of bemerkingen"}]
["Gelieve hier te antwoorden of naam bijlage te vermelden en het vak naar lengte van het antwoord te vergroten  aub"]
[{"$f":"IF('Indirecte werkingskosten'!P78=0, \"Geen vragen of bemerkingen\",'Indirecte werkingskosten'!P78)","v":"Geen vragen of bemerkingen"}]
["Gelieve hier te antwoorden of naam bijlage te vermelden en het vak naar lengte van het antwoord te vergroten  aub"]
[{"$f":"IF('Indirecte werkingskosten'!P79=0, \"Geen vragen of bemerkingen\",'Indirecte werkingskosten'!P79)","v":"Geen vragen of bemerkingen"}]
["Gelieve hier te antwoorden of naam bijlage te vermelden en het vak naar lengte van het antwoord te vergroten  aub"]
[{"$f":"IF('Indirecte werkingskosten'!P80=0, \"Geen vragen of bemerkingen\",'Indirecte werkingskosten'!P80)","v":"Geen vragen of bemerkingen"}]
["Gelieve hier te antwoorden of naam bijlage te vermelden en het vak naar lengte van het antwoord te vergroten  aub"]
[{"$f":"IF('Indirecte werkingskosten'!P81=0, \"Geen vragen of bemerkingen\",'Indirecte werkingskosten'!P81)","v":"Geen vragen of bemerkingen"}]
["Gelieve hier te antwoorden of naam bijlage te vermelden en het vak naar lengte van het antwoord te vergroten  aub"]
[{"$f":"IF('Indirecte werkingskosten'!P82=0, \"Geen vragen of bemerkingen\",'Indirecte werkingskosten'!P82)","v":"Geen vragen of bemerkingen"}]
["Gelieve hier te antwoorden of naam bijlage te vermelden en het vak naar lengte van het antwoord te vergroten  aub"]
[{"$f":"IF('Indirecte werkingskosten'!P83=0, \"Geen vragen of bemerkingen\",'Indirecte werkingskosten'!P83)","v":"Geen vragen of bemerkingen"}]
["Gelieve hier te antwoorden of naam bijlage te vermelden en het vak naar lengte van het antwoord te vergroten  aub"]
[]
[{"$f":"'Indirecte werkingskosten'!D84","v":"Kies uit lijst Indirecte Werkingskosten"}]
[]
[{"$f":"IF('Indirecte werkingskosten'!P84=0, \"Geen vragen of bemerkingen\",'Indirecte werkingskosten'!P84)","v":"Geen vragen of bemerkingen"}]
["Gelieve hier te antwoorden of naam bijlage te vermelden en het vak naar lengte van het antwoord te vergroten  aub"]
[{"$f":"IF('Indirecte werkingskosten'!P85=0, \"Geen vragen of bemerkingen\",'Indirecte werkingskosten'!P85)","v":"Geen vragen of bemerkingen"}]
["Gelieve hier te antwoorden of naam bijlage te vermelden en het vak naar lengte van het antwoord te vergroten  aub"]
[{"$f":"IF('Indirecte werkingskosten'!P86=0, \"Geen vragen of bemerkingen\",'Indirecte werkingskosten'!P86)","v":"Geen vragen of bemerkingen"}]
["Gelieve hier te antwoorden of naam bijlage te vermelden en het vak naar lengte van het antwoord te vergroten  aub"]
[{"$f":"IF('Indirecte werkingskosten'!P87=0, \"Geen vragen of bemerkingen\",'Indirecte werkingskosten'!P87)","v":"Geen vragen of bemerkingen"}]
["Gelieve hier te antwoorden of naam bijlage te vermelden en het vak naar lengte van het antwoord te vergroten  aub"]
[{"$f":"IF('Indirecte werkingskosten'!P88=0, \"Geen vragen of bemerkingen\",'Indirecte werkingskosten'!P88)","v":"Geen vragen of bemerkingen"}]
["Gelieve hier te antwoorden of naam bijlage te vermelden en het vak naar lengte van het antwoord te vergroten  aub"]
[{"$f":"IF('Indirecte werkingskosten'!P89=0, \"Geen vragen of bemerkingen\",'Indirecte werkingskosten'!P89)","v":"Geen vragen of bemerkingen"}]
["Gelieve hier te antwoorden of naam bijlage te vermelden en het vak naar lengte van het antwoord te vergroten  aub"]
[{"$f":"IF('Indirecte werkingskosten'!P90=0, \"Geen vragen of bemerkingen\",'Indirecte werkingskosten'!P90)","v":"Geen vragen of bemerkingen"}]
["Gelieve hier te antwoorden of naam bijlage te vermelden en het vak naar lengte van het antwoord te vergroten  aub"]
[{"$f":"IF('Indirecte werkingskosten'!P91=0, \"Geen vragen of bemerkingen\",'Indirecte werkingskosten'!P91)","v":"Geen vragen of bemerkingen"}]
["Gelieve hier te antwoorden of naam bijlage te vermelden en het vak naar lengte van het antwoord te vergroten  aub"]
[{"$f":"IF('Indirecte werkingskosten'!P92=0, \"Geen vragen of bemerkingen\",'Indirecte werkingskosten'!P92)","v":"Geen vragen of bemerkingen"}]
["Gelieve hier te antwoorden of naam bijlage te vermelden en het vak naar lengte van het antwoord te vergroten  aub"]
[{"$f":"IF('Indirecte werkingskosten'!P93=0, \"Geen vragen of bemerkingen\",'Indirecte werkingskosten'!P93)","v":"Geen vragen of bemerkingen"}]
["Gelieve hier te antwoorden of naam bijlage te vermelden en het vak naar lengte van het antwoord te vergroten  aub"]
[{"$f":"IF('Indirecte werkingskosten'!P94=0, \"Geen vragen of bemerkingen\",'Indirecte werkingskosten'!P94)","v":"Geen vragen of bemerkingen"}]
["Gelieve hier te antwoorden of naam bijlage te vermelden en het vak naar lengte van het antwoord te vergroten  aub"]
[{"$f":"IF('Indirecte werkingskosten'!P95=0, \"Geen vragen of bemerkingen\",'Indirecte werkingskosten'!P95)","v":"Geen vragen of bemerkingen"}]
["Gelieve hier te antwoorden of naam bijlage te vermelden en het vak naar lengte van het antwoord te vergroten  aub"]
[{"$f":"IF('Indirecte werkingskosten'!P96=0, \"Geen vragen of bemerkingen\",'Indirecte werkingskosten'!P96)","v":"Geen vragen of bemerkingen"}]
["Gelieve hier te antwoorden of naam bijlage te vermelden en het vak naar lengte van het antwoord te vergroten  aub"]
[]
[{"$f":"'Indirecte werkingskosten'!D97","v":"Kies uit lijst Indirecte Werkingskosten"}]
[]
[{"$f":"IF('Indirecte werkingskosten'!P97=0, \"Geen vragen of bemerkingen\",'Indirecte werkingskosten'!P97)","v":"Geen vragen of bemerkingen"}]
["Gelieve hier te antwoorden of naam bijlage te vermelden en het vak naar lengte van het antwoord te vergroten  aub"]
[{"$f":"IF('Indirecte werkingskosten'!P98=0, \"Geen vragen of bemerkingen\",'Indirecte werkingskosten'!P98)","v":"Geen vragen of bemerkingen"}]
["Gelieve hier te antwoorden of naam bijlage te vermelden en het vak naar lengte van het antwoord te vergroten  aub"]
[{"$f":"IF('Indirecte werkingskosten'!P99=0, \"Geen vragen of bemerkingen\",'Indirecte werkingskosten'!P99)","v":"Geen vragen of bemerkingen"}]
["Gelieve hier te antwoorden of naam bijlage te vermelden en het vak naar lengte van het antwoord te vergroten  aub"]
[{"$f":"IF('Indirecte werkingskosten'!P100=0, \"Geen vragen of bemerkingen\",'Indirecte werkingskosten'!P100)","v":"Geen vragen of bemerkingen"}]
["Gelieve hier te antwoorden of naam bijlage te vermelden en het vak naar lengte van het antwoord te vergroten  aub"]
[{"$f":"IF('Indirecte werkingskosten'!P101=0, \"Geen vragen of bemerkingen\",'Indirecte werkingskosten'!P101)","v":"Geen vragen of bemerkingen"}]
["Gelieve hier te antwoorden of naam bijlage te vermelden en het vak naar lengte van het antwoord te vergroten  aub"]
[{"$f":"IF('Indirecte werkingskosten'!P102=0, \"Geen vragen of bemerkingen\",'Indirecte werkingskosten'!P102)","v":"Geen vragen of bemerkingen"}]
["Gelieve hier te antwoorden of naam bijlage te vermelden en het vak naar lengte van het antwoord te vergroten  aub"]
[{"$f":"IF('Indirecte werkingskosten'!P103=0, \"Geen vragen of bemerkingen\",'Indirecte werkingskosten'!P103)","v":"Geen vragen of bemerkingen"}]
["Gelieve hier te antwoorden of naam bijlage te vermelden en het vak naar lengte van het antwoord te vergroten  aub"]
[{"$f":"IF('Indirecte werkingskosten'!P104=0, \"Geen vragen of bemerkingen\",'Indirecte werkingskosten'!P104)","v":"Geen vragen of bemerkingen"}]
["Gelieve hier te antwoorden of naam bijlage te vermelden en het vak naar lengte van het antwoord te vergroten  aub"]
[{"$f":"IF('Indirecte werkingskosten'!P105=0, \"Geen vragen of bemerkingen\",'Indirecte werkingskosten'!P105)","v":"Geen vragen of bemerkingen"}]
["Gelieve hier te antwoorden of naam bijlage te vermelden en het vak naar lengte van het antwoord te vergroten  aub"]
[{"$f":"IF('Indirecte werkingskosten'!P106=0, \"Geen vragen of bemerkingen\",'Indirecte werkingskosten'!P106)","v":"Geen vragen of bemerkingen"}]
["Gelieve hier te antwoorden of naam bijlage te vermelden en het vak naar lengte van het antwoord te vergroten  aub"]
[{"$f":"IF('Indirecte werkingskosten'!P107=0, \"Geen vragen of bemerkingen\",'Indirecte werkingskosten'!P107)","v":"Geen vragen of bemerkingen"}]
["Gelieve hier te antwoorden of naam bijlage te vermelden en het vak naar lengte van het antwoord te vergroten  aub"]
[{"$f":"IF('Indirecte werkingskosten'!P108=0, \"Geen vragen of bemerkingen\",'Indirecte werkingskosten'!P108)","v":"Geen vragen of bemerkingen"}]
["Gelieve hier te antwoorden of naam bijlage te vermelden en het vak naar lengte van het antwoord te vergroten  aub"]
[{"$f":"IF('Indirecte werkingskosten'!P109=0, \"Geen vragen of bemerkingen\",'Indirecte werkingskosten'!P109)","v":"Geen vragen of bemerkingen"}]
["Gelieve hier te antwoorden of naam bijlage te vermelden en het vak naar lengte van het antwoord te vergroten  aub"]
[]
[{"$f":"'Indirecte werkingskosten'!D110","v":"Kies uit lijst Indirecte Werkingskosten"}]
[]
[{"$f":"IF('Indirecte werkingskosten'!P110=0, \"Geen vragen of bemerkingen\",'Indirecte werkingskosten'!P110)","v":"Geen vragen of bemerkingen"}]
["Gelieve hier te antwoorden of naam bijlage te vermelden en het vak naar lengte van het antwoord te vergroten  aub"]
[{"$f":"IF('Indirecte werkingskosten'!P111=0, \"Geen vragen of bemerkingen\",'Indirecte werkingskosten'!P111)","v":"Geen vragen of bemerkingen"}]
["Gelieve hier te antwoorden of naam bijlage te vermelden en het vak naar lengte van het antwoord te vergroten  aub"]
[{"$f":"IF('Indirecte werkingskosten'!P112=0, \"Geen vragen of bemerkingen\",'Indirecte werkingskosten'!P112)","v":"Geen vragen of bemerkingen"}]
["Gelieve hier te antwoorden of naam bijlage te vermelden en het vak naar lengte van het antwoord te vergroten  aub"]
[{"$f":"IF('Indirecte werkingskosten'!P113=0, \"Geen vragen of bemerkingen\",'Indirecte werkingskosten'!P113)","v":"Geen vragen of bemerkingen"}]
["Gelieve hier te antwoorden of naam bijlage te vermelden en het vak naar lengte van het antwoord te vergroten  aub"]
[{"$f":"IF('Indirecte werkingskosten'!P114=0, \"Geen vragen of bemerkingen\",'Indirecte werkingskosten'!P114)","v":"Geen vragen of bemerkingen"}]
["Gelieve hier te antwoorden of naam bijlage te vermelden en het vak naar lengte van het antwoord te vergroten  aub"]
[{"$f":"IF('Indirecte werkingskosten'!P115=0, \"Geen vragen of bemerkingen\",'Indirecte werkingskosten'!P115)","v":"Geen vragen of bemerkingen"}]
["Gelieve hier te antwoorden of naam bijlage te vermelden en het vak naar lengte van het antwoord te vergroten  aub"]
[{"$f":"IF('Indirecte werkingskosten'!P116=0, \"Geen vragen of bemerkingen\",'Indirecte werkingskosten'!P116)","v":"Geen vragen of bemerkingen"}]
["Gelieve hier te antwoorden of naam bijlage te vermelden en het vak naar lengte van het antwoord te vergroten  aub"]
[{"$f":"IF('Indirecte werkingskosten'!P117=0, \"Geen vragen of bemerkingen\",'Indirecte werkingskosten'!P117)","v":"Geen vragen of bemerkingen"}]
["Gelieve hier te antwoorden of naam bijlage te vermelden en het vak naar lengte van het antwoord te vergroten  aub"]
[{"$f":"IF('Indirecte werkingskosten'!P118=0, \"Geen vragen of bemerkingen\",'Indirecte werkingskosten'!P118)","v":"Geen vragen of bemerkingen"}]
["Gelieve hier te antwoorden of naam bijlage te vermelden en het vak naar lengte van het antwoord te vergroten  aub"]
[{"$f":"IF('Indirecte werkingskosten'!P119=0, \"Geen vragen of bemerkingen\",'Indirecte werkingskosten'!P119)","v":"Geen vragen of bemerkingen"}]
["Gelieve hier te antwoorden of naam bijlage te vermelden en het vak naar lengte van het antwoord te vergroten  aub"]
[{"$f":"IF('Indirecte werkingskosten'!P120=0, \"Geen vragen of bemerkingen\",'Indirecte werkingskosten'!P120)","v":"Geen vragen of bemerkingen"}]
["Gelieve hier te antwoorden of naam bijlage te vermelden en het vak naar lengte van het antwoord te vergroten  aub"]
[{"$f":"IF('Indirecte werkingskosten'!P121=0, \"Geen vragen of bemerkingen\",'Indirecte werkingskosten'!P121)","v":"Geen vragen of bemerkingen"}]
["Gelieve hier te antwoorden of naam bijlage te vermelden en het vak naar lengte van het antwoord te vergroten  aub"]
[{"$f":"IF('Indirecte werkingskosten'!P122=0, \"Geen vragen of bemerkingen\",'Indirecte werkingskosten'!P122)","v":"Geen vragen of bemerkingen"}]
["Gelieve hier te antwoorden of naam bijlage te vermelden en het vak naar lengte van het antwoord te vergroten  aub"]
[]
[{"$f":"'Indirecte werkingskosten'!D123","v":"Kies uit lijst Indirecte Werkingskosten"}]
[]
[{"$f":"IF('Indirecte werkingskosten'!P123=0, \"Geen vragen of bemerkingen\",'Indirecte werkingskosten'!P123)","v":"Geen vragen of bemerkingen"}]
["Gelieve hier te antwoorden of naam bijlage te vermelden en het vak naar lengte van het antwoord te vergroten  aub"]
[{"$f":"IF('Indirecte werkingskosten'!P124=0, \"Geen vragen of bemerkingen\",'Indirecte werkingskosten'!P124)","v":"Geen vragen of bemerkingen"}]
["Gelieve hier te antwoorden of naam bijlage te vermelden en het vak naar lengte van het antwoord te vergroten  aub"]
[{"$f":"IF('Indirecte werkingskosten'!P125=0, \"Geen vragen of bemerkingen\",'Indirecte werkingskosten'!P125)","v":"Geen vragen of bemerkingen"}]
["Gelieve hier te antwoorden of naam bijlage te vermelden en het vak naar lengte van het antwoord te vergroten  aub"]
[{"$f":"IF('Indirecte werkingskosten'!P126=0, \"Geen vragen of bemerkingen\",'Indirecte werkingskosten'!P126)","v":"Geen vragen of bemerkingen"}]
["Gelieve hier te antwoorden of naam bijlage te vermelden en het vak naar lengte van het antwoord te vergroten  aub"]
[{"$f":"IF('Indirecte werkingskosten'!P127=0, \"Geen vragen of bemerkingen\",'Indirecte werkingskosten'!P127)","v":"Geen vragen of bemerkingen"}]
["Gelieve hier te antwoorden of naam bijlage te vermelden en het vak naar lengte van het antwoord te vergroten  aub"]
[{"$f":"IF('Indirecte werkingskosten'!P128=0, \"Geen vragen of bemerkingen\",'Indirecte werkingskosten'!P128)","v":"Geen vragen of bemerkingen"}]
["Gelieve hier te antwoorden of naam bijlage te vermelden en het vak naar lengte van het antwoord te vergroten  aub"]
[{"$f":"IF('Indirecte werkingskosten'!P129=0, \"Geen vragen of bemerkingen\",'Indirecte werkingskosten'!P129)","v":"Geen vragen of bemerkingen"}]
["Gelieve hier te antwoorden of naam bijlage te vermelden en het vak naar lengte van het antwoord te vergroten  aub"]
[{"$f":"IF('Indirecte werkingskosten'!P130=0, \"Geen vragen of bemerkingen\",'Indirecte werkingskosten'!P130)","v":"Geen vragen of bemerkingen"}]
["Gelieve hier te antwoorden of naam bijlage te vermelden en het vak naar lengte van het antwoord te vergroten  aub"]
[{"$f":"IF('Indirecte werkingskosten'!P131=0, \"Geen vragen of bemerkingen\",'Indirecte werkingskosten'!P131)","v":"Geen vragen of bemerkingen"}]
["Gelieve hier te antwoorden of naam bijlage te vermelden en het vak naar lengte van het antwoord te vergroten  aub"]
[{"$f":"IF('Indirecte werkingskosten'!P132=0, \"Geen vragen of bemerkingen\",'Indirecte werkingskosten'!P132)","v":"Geen vragen of bemerkingen"}]
["Gelieve hier te antwoorden of naam bijlage te vermelden en het vak naar lengte van het antwoord te vergroten  aub"]
[{"$f":"IF('Indirecte werkingskosten'!P133=0, \"Geen vragen of bemerkingen\",'Indirecte werkingskosten'!P133)","v":"Geen vragen of bemerkingen"}]
["Gelieve hier te antwoorden of naam bijlage te vermelden en het vak naar lengte van het antwoord te vergroten  aub"]
[{"$f":"IF('Indirecte werkingskosten'!P134=0, \"Geen vragen of bemerkingen\",'Indirecte werkingskosten'!P134)","v":"Geen vragen of bemerkingen"}]
["Gelieve hier te antwoorden of naam bijlage te vermelden en het vak naar lengte van het antwoord te vergroten  aub"]
[{"$f":"IF('Indirecte werkingskosten'!P135=0, \"Geen vragen of bemerkingen\",'Indirecte werkingskosten'!P135)","v":"Geen vragen of bemerkingen"}]
["Gelieve hier te antwoorden of naam bijlage te vermelden en het vak naar lengte van het antwoord te vergroten  aub"]
[]
[{"$f":"'Indirecte werkingskosten'!D136","v":"Andere: (zelf in te vullen)"}]
[]
[{"$f":"IF('Indirecte werkingskosten'!P136=0, \"Geen vragen of bemerkingen\",'Indirecte werkingskosten'!P136)","v":"Geen vragen of bemerkingen"}]
["Gelieve hier te antwoorden of naam bijlage te vermelden en het vak naar lengte van het antwoord te vergroten  aub"]
[{"$f":"IF('Indirecte werkingskosten'!P137=0, \"Geen vragen of bemerkingen\",'Indirecte werkingskosten'!P137)","v":"Geen vragen of bemerkingen"}]
["Gelieve hier te antwoorden of naam bijlage te vermelden en het vak naar lengte van het antwoord te vergroten  aub"]
[{"$f":"IF('Indirecte werkingskosten'!P138=0, \"Geen vragen of bemerkingen\",'Indirecte werkingskosten'!P138)","v":"Geen vragen of bemerkingen"}]
["Gelieve hier te antwoorden of naam bijlage te vermelden en het vak naar lengte van het antwoord te vergroten  aub"]
[{"$f":"IF('Indirecte werkingskosten'!P139=0, \"Geen vragen of bemerkingen\",'Indirecte werkingskosten'!P139)","v":"Geen vragen of bemerkingen"}]
["Gelieve hier te antwoorden of naam bijlage te vermelden en het vak naar lengte van het antwoord te vergroten  aub"]
[{"$f":"IF('Indirecte werkingskosten'!P140=0, \"Geen vragen of bemerkingen\",'Indirecte werkingskosten'!P140)","v":"Geen vragen of bemerkingen"}]
["Gelieve hier te antwoorden of naam bijlage te vermelden en het vak naar lengte van het antwoord te vergroten  aub"]
[{"$f":"IF('Indirecte werkingskosten'!P141=0, \"Geen vragen of bemerkingen\",'Indirecte werkingskosten'!P141)","v":"Geen vragen of bemerkingen"}]
["Gelieve hier te antwoorden of naam bijlage te vermelden en het vak naar lengte van het antwoord te vergroten  aub"]
[{"$f":"IF('Indirecte werkingskosten'!P142=0, \"Geen vragen of bemerkingen\",'Indirecte werkingskosten'!P142)","v":"Geen vragen of bemerkingen"}]
["Gelieve hier te antwoorden of naam bijlage te vermelden en het vak naar lengte van het antwoord te vergroten  aub"]
[{"$f":"IF('Indirecte werkingskosten'!P143=0, \"Geen vragen of bemerkingen\",'Indirecte werkingskosten'!P143)","v":"Geen vragen of bemerkingen"}]
["Gelieve hier te antwoorden of naam bijlage te vermelden en het vak naar lengte van het antwoord te vergroten  aub"]
[{"$f":"IF('Indirecte werkingskosten'!P144=0, \"Geen vragen of bemerkingen\",'Indirecte werkingskosten'!P144)","v":"Geen vragen of bemerkingen"}]
["Gelieve hier te antwoorden of naam bijlage te vermelden en het vak naar lengte van het antwoord te vergroten  aub"]
[{"$f":"IF('Indirecte werkingskosten'!P145=0, \"Geen vragen of bemerkingen\",'Indirecte werkingskosten'!P145)","v":"Geen vragen of bemerkingen"}]
["Gelieve hier te antwoorden of naam bijlage te vermelden en het vak naar lengte van het antwoord te vergroten  aub"]
[{"$f":"IF('Indirecte werkingskosten'!P146=0, \"Geen vragen of bemerkingen\",'Indirecte werkingskosten'!P146)","v":"Geen vragen of bemerkingen"}]
["Gelieve hier te antwoorden of naam bijlage te vermelden en het vak naar lengte van het antwoord te vergroten  aub"]
[{"$f":"IF('Indirecte werkingskosten'!P147=0, \"Geen vragen of bemerkingen\",'Indirecte werkingskosten'!P147)","v":"Geen vragen of bemerkingen"}]
["Gelieve hier te antwoorden of naam bijlage te vermelden en het vak naar lengte van het antwoord te vergroten  aub"]
[{"$f":"IF('Indirecte werkingskosten'!P148=0, \"Geen vragen of bemerkingen\",'Indirecte werkingskosten'!P148)","v":"Geen vragen of bemerkingen"}]
["Gelieve hier te antwoorden of naam bijlage te vermelden en het vak naar lengte van het antwoord te vergroten  aub"]
[]
[{"$f":"'Indirecte werkingskosten'!D149","v":"Andere: (zelf in te vullen)"}]
[]
[{"$f":"IF('Indirecte werkingskosten'!P149=0, \"Geen vragen of bemerkingen\",'Indirecte werkingskosten'!P149)","v":"Geen vragen of bemerkingen"}]
["Gelieve hier te antwoorden of naam bijlage te vermelden en het vak naar lengte van het antwoord te vergroten  aub"]
[{"$f":"IF('Indirecte werkingskosten'!P150=0, \"Geen vragen of bemerkingen\",'Indirecte werkingskosten'!P150)","v":"Geen vragen of bemerkingen"}]
["Gelieve hier te antwoorden of naam bijlage te vermelden en het vak naar lengte van het antwoord te vergroten  aub"]
[{"$f":"IF('Indirecte werkingskosten'!P151=0, \"Geen vragen of bemerkingen\",'Indirecte werkingskosten'!P151)","v":"Geen vragen of bemerkingen"}]
["Gelieve hier te antwoorden of naam bijlage te vermelden en het vak naar lengte van het antwoord te vergroten  aub"]
[{"$f":"IF('Indirecte werkingskosten'!P152=0, \"Geen vragen of bemerkingen\",'Indirecte werkingskosten'!P152)","v":"Geen vragen of bemerkingen"}]
["Gelieve hier te antwoorden of naam bijlage te vermelden en het vak naar lengte van het antwoord te vergroten  aub"]
[{"$f":"IF('Indirecte werkingskosten'!P153=0, \"Geen vragen of bemerkingen\",'Indirecte werkingskosten'!P153)","v":"Geen vragen of bemerkingen"}]
["Gelieve hier te antwoorden of naam bijlage te vermelden en het vak naar lengte van het antwoord te vergroten  aub"]
[{"$f":"IF('Indirecte werkingskosten'!P154=0, \"Geen vragen of bemerkingen\",'Indirecte werkingskosten'!P154)","v":"Geen vragen of bemerkingen"}]
["Gelieve hier te antwoorden of naam bijlage te vermelden en het vak naar lengte van het antwoord te vergroten  aub"]
[{"$f":"IF('Indirecte werkingskosten'!P155=0, \"Geen vragen of bemerkingen\",'Indirecte werkingskosten'!P155)","v":"Geen vragen of bemerkingen"}]
["Gelieve hier te antwoorden of naam bijlage te vermelden en het vak naar lengte van het antwoord te vergroten  aub"]
[{"$f":"IF('Indirecte werkingskosten'!P156=0, \"Geen vragen of bemerkingen\",'Indirecte werkingskosten'!P156)","v":"Geen vragen of bemerkingen"}]
["Gelieve hier te antwoorden of naam bijlage te vermelden en het vak naar lengte van het antwoord te vergroten  aub"]
[{"$f":"IF('Indirecte werkingskosten'!P157=0, \"Geen vragen of bemerkingen\",'Indirecte werkingskosten'!P157)","v":"Geen vragen of bemerkingen"}]
["Gelieve hier te antwoorden of naam bijlage te vermelden en het vak naar lengte van het antwoord te vergroten  aub"]
[{"$f":"IF('Indirecte werkingskosten'!P158=0, \"Geen vragen of bemerkingen\",'Indirecte werkingskosten'!P158)","v":"Geen vragen of bemerkingen"}]
["Gelieve hier te antwoorden of naam bijlage te vermelden en het vak naar lengte van het antwoord te vergroten  aub"]
[{"$f":"IF('Indirecte werkingskosten'!P159=0, \"Geen vragen of bemerkingen\",'Indirecte werkingskosten'!P159)","v":"Geen vragen of bemerkingen"}]
["Gelieve hier te antwoorden of naam bijlage te vermelden en het vak naar lengte van het antwoord te vergroten  aub"]
[{"$f":"IF('Indirecte werkingskosten'!P160=0, \"Geen vragen of bemerkingen\",'Indirecte werkingskosten'!P160)","v":"Geen vragen of bemerkingen"}]
["Gelieve hier te antwoorden of naam bijlage te vermelden en het vak naar lengte van het antwoord te vergroten  aub"]
[{"$f":"IF('Indirecte werkingskosten'!P161=0, \"Geen vragen of bemerkingen\",'Indirecte werkingskosten'!P161)","v":"Geen vragen of bemerkingen"}]
["Gelieve hier te antwoorden of naam bijlage te vermelden en het vak naar lengte van het antwoord te vergroten  aub"]
[{"$f":"IF('Indirecte werkingskosten'!P162=0, \"Geen vragen of bemerkingen\",'Indirecte werkingskosten'!P162)","v":"Geen vragen of bemerkingen"}]
["Gelieve hier te antwoorden of naam bijlage te vermelden en het vak naar lengte van het antwoord te vergroten  aub"]

{"sheet":"Overzicht budget-uitgaven","index":18,"n_rows":62,"n_cols":10,"rows_kept":62,"cut":false,"hidden":true,"merged":[[7,2,7,3],[7,4,7,9],[8,2,8,3],[8,4,8,9],[9,2,9,3],[9,4,9,9],[10,2,10,3],[10,4,10,9],[11,2,11,3],[11,4,11,9],[29,2,29,3],[13,2,13,3],[14,2,14,3],[23,2,23,3],[24,2,24,3],[25,2,25,3],[26,2,26,3],[27,2,27,3],[28,2,28,3],[30,2,30,3],[31,2,31,3],[32,2,32,3],[33,2,33,3],[53,2,53,3],[45,2,45,3],[46,2,46,3],[47,2,47,3],[48,2,48,3],[49,2,49,3],[50,2,50,3],[51,2,51,3],[52,2,52,3],[61,5,61,9],[59,2,59,3],[54,2,54,3],[55,2,55,3],[56,2,56,3],[57,2,57,3],[58,2,58,3]]}
[]
[]
[]
[null,null,null,"Alle cellen van C tem F moeten gelinkt worden met goedgekeurd budget AJU, reële uitgaven moeten we mss tocg vragen dat ze zelf invullen?"]
[]
[]
[]
[null,null,{"$f":"'AANVRAAG BUDGET AJU'!C8","v":"Datum aanvraag:"},null,{"$f":"'AANVRAAG BUDGET AJU'!F8","v":"2020-09-11"}]
[null,null,"Begunstigde:",null,{"$f":"'AANVRAAG BUDGET AJU'!F9","v":0}]
[null,null,"Project:",null,{"$f":"'AANVRAAG BUDGET AJU'!F10","v":0}]
[null,null,"Contactpersoon",null,{"$f":"'AANVRAAG BUDGET AJU'!F11","v":0}]
[null,null,"Looptijd project (aantal maanden):",null,{"$f":"'AANVRAAG BUDGET AJU'!F12","v":0}]
[]
[null,null,{"$f":"'AANVRAAG BUDGET AJU'!C17","v":"Budget 2021"},null,"Totaal bedrag project","Goedgekeurde Subsidie door Fedasil","% Fedasil","Reële Uitgaven","Reële Uitgaven %","Delta"]
[null,null,"Personeel"]
[null,null,{"$f":"'BUDGET VS ACTUAL'!P16","v":"(naam in te vullen)"},"(functie in te vullen)",{"$f":"'BUDGET VS ACTUAL'!V16","v":0},{"$f":"'BUDGET VS ACTUAL'!W16","v":0},{"$f":"IF(E16=0,0,F16/E16)","v":0},{"$f":"IF('BUDGET VS ACTUAL'!AL16=0,'BUDGET VS ACTUAL'!AF16,'BUDGET VS ACTUAL'!AL16)","v":0},{"$f":"IF('BUDGET VS ACTUAL'!AM16=0,'BUDGET VS ACTUAL'!AG16,'BUDGET VS ACTUAL'!AM16)","v":0},{"$f":"H16-F16","v":0}]
[null,null,{"$f":"'BUDGET VS ACTUAL'!P17","v":"(naam in te vullen)"},"(functie in te vullen)",{"$f":"'BUDGET VS ACTUAL'!V17","v":0},{"$f":"'BUDGET VS ACTUAL'!W17","v":0},{"$f":"IF(E17=0,0,F17/E17)","v":0},{"$f":"IF('BUDGET VS ACTUAL'!AL17=0,'BUDGET VS ACTUAL'!AF17,'BUDGET VS ACTUAL'!AL17)","v":0},{"$f":"IF('BUDGET VS ACTUAL'!AM17=0,'BUDGET VS ACTUAL'!AG17,'BUDGET VS ACTUAL'!AM17)","v":0},{"$f":"H17-F17","v":0}]
[null,null,{"$f":"'BUDGET VS ACTUAL'!P18","v":"(naam in te vullen)"},"(functie in te vullen)",{"$f":"'BUDGET VS ACTUAL'!V18","v":0},{"$f":"'BUDGET VS ACTUAL'!W18","v":0},{"$f":"IF(E18=0,0,F18/E18)","v":0},{"$f":"IF('BUDGET VS ACTUAL'!AL18=0,'BUDGET VS ACTUAL'!AF18,'BUDGET VS ACTUAL'!AL18)","v":0},{"$f":"IF('BUDGET VS ACTUAL'!AM18=0,'BUDGET VS ACTUAL'!AG18,'BUDGET VS ACTUAL'!AM18)","v":0},0]
[null,null,{"$f":"'BUDGET VS ACTUAL'!P19","v":"(naam in te vullen)"},"(functie in te vullen)",{"$f":"'BUDGET VS ACTUAL'!V19","v":0},{"$f":"'BUDGET VS ACTUAL'!W19","v":0},0,{"$f":"IF('BUDGET VS ACTUAL'!AL19=0,'BUDGET VS ACTUAL'!AF19,'BUDGET VS ACTUAL'!AL19)","v":0},{"$f":"IF('BUDGET VS ACTUAL'!AM19=0,'BUDGET VS ACTUAL'!AG19,'BUDGET VS ACTUAL'!AM19)","v":0},0]
[null,null,{"$f":"'BUDGET VS ACTUAL'!P20","v":"(naam in te vullen)"},"(functie in te vullen)",{"$f":"'BUDGET VS ACTUAL'!V20","v":0},{"$f":"'BUDGET VS ACTUAL'!W20","v":0},0,{"$f":"IF('BUDGET VS ACTUAL'!AL20=0,'BUDGET VS ACTUAL'!AF20,'BUDGET VS ACTUAL'!AL20)","v":0},{"$f":"IF('BUDGET VS ACTUAL'!AM20=0,'BUDGET VS ACTUAL'!AG20,'BUDGET VS ACTUAL'!AM20)","v":0},0]
[null,null,{"$f":"'BUDGET VS ACTUAL'!P21","v":"(naam in te vullen)"},"(functie in te vullen)",{"$f":"'BUDGET VS ACTUAL'!V21","v":0},{"$f":"'BUDGET VS ACTUAL'!W21","v":0},0,{"$f":"IF('BUDGET VS ACTUAL'!AL21=0,'BUDGET VS ACTUAL'!AF21,'BUDGET VS ACTUAL'!AL21)","v":0},{"$f":"IF('BUDGET VS ACTUAL'!AM21=0,'BUDGET VS ACTUAL'!AG21,'BUDGET VS ACTUAL'!AM21)","v":0},0]
[null,null,{"$f":"'BUDGET VS ACTUAL'!P22","v":"(naam in te vullen)"},"(functie in te vullen)",{"$f":"'BUDGET VS ACTUAL'!V22","v":0},{"$f":"'BUDGET VS ACTUAL'!W22","v":0},0,{"$f":"IF('BUDGET VS ACTUAL'!AL22=0,'BUDGET VS ACTUAL'!AF22,'BUDGET VS ACTUAL'!AL22)","v":0},{"$f":"IF('BUDGET VS ACTUAL'!AM22=0,'BUDGET VS ACTUAL'!AG22,'BUDGET VS ACTUAL'!AM22)","v":0},0]
[null,null,{"$f":"'BUDGET VS ACTUAL'!P23","v":"(naam in te vullen)"},"(functie in te vullen)",{"$f":"'BUDGET VS ACTUAL'!V23","v":0},{"$f":"'BUDGET VS ACTUAL'!W23","v":0},0,{"$f":"IF('BUDGET VS ACTUAL'!AL23=0,'BUDGET VS ACTUAL'!AF23,'BUDGET VS ACTUAL'!AL23)","v":0},{"$f":"IF('BUDGET VS ACTUAL'!AM23=0,'BUDGET VS ACTUAL'!AG23,'BUDGET VS ACTUAL'!AM23)","v":0},0]
[null,null,"Totaal",null,{"$f":"SUM(E16:E23)","v":0},{"$f":"SUM(F16:F23)","v":0},{"$f":"IF(E24=0,0,F24/E24)","v":0},{"$f":"SUM(H16:H23)","v":0},{"$f":"AVERAGE(I16:I23)","v":0},{"$f":"H24-F24","v":0}]
[null,null,"Huur"]
[null,null,{"$f":"'BUDGET VS ACTUAL'!P26","v":"(Voorwerp/Gebouw & Adres in te vullen)"},null,{"$f":"'BUDGET VS ACTUAL'!V26","v":0},{"$f":"'BUDGET VS ACTUAL'!W26","v":0},0,{"$f":"IF('BUDGET VS ACTUAL'!AL26=0,'BUDGET VS ACTUAL'!AF26,'BUDGET VS ACTUAL'!AL26)","v":0},{"$f":"'BUDGET VS ACTUAL'!AM26","v":0},{"$f":"H26-F26","v":0}]
[null,null,"Totaal",null,{"$f":"E26","v":0},{"$f":"SUM(F26)","v":0},{"$f":"IF(E27=0,0,F27/E27)","v":0},{"$f":"SUM(H26)","v":0},{"$f":"AVERAGE(I26)","v":0},{"$f":"H27-F27","v":0}]
[null,null,"Investeringen (vb. hard-en/of software) "]
[null,null,{"$f":"'BUDGET VS ACTUAL'!P29","v":"(Beschrijving in te vullen)"},null,{"$f":"'BUDGET VS ACTUAL'!V29","v":0},{"$f":"'BUDGET VS ACTUAL'!W29","v":0},0,{"$f":"IF('BUDGET VS ACTUAL'!AL29=0,'BUDGET VS ACTUAL'!AF29,'BUDGET VS ACTUAL'!AL29)","v":0},{"$f":"'BUDGET VS ACTUAL'!AM29","v":0},{"$f":"H29-F29","v":0}]
[null,null,{"$f":"'BUDGET VS ACTUAL'!P30","v":"(in te vullen)"},null,{"$f":"'BUDGET VS ACTUAL'!V30","v":0},{"$f":"'BUDGET VS ACTUAL'!W30","v":0},0,{"$f":"IF('BUDGET VS ACTUAL'!AL30=0,'BUDGET VS ACTUAL'!AF30,'BUDGET VS ACTUAL'!AL30)","v":0},{"$f":"'BUDGET VS ACTUAL'!AM30","v":0},0]
[null,null,{"$f":"'BUDGET VS ACTUAL'!P31","v":"(in te vullen)"},null,{"$f":"'BUDGET VS ACTUAL'!V31","v":0},{"$f":"'BUDGET VS ACTUAL'!W31","v":0},0,{"$f":"IF('BUDGET VS ACTUAL'!AL31=0,'BUDGET VS ACTUAL'!AF31,'BUDGET VS ACTUAL'!AL31)","v":0},{"$f":"'BUDGET VS ACTUAL'!AM31","v":0},0]
[null,null,{"$f":"'BUDGET VS ACTUAL'!P32","v":"(in te vullen)"},null,{"$f":"'BUDGET VS ACTUAL'!V32","v":0},{"$f":"'BUDGET VS ACTUAL'!W32","v":0},0,{"$f":"IF('BUDGET VS ACTUAL'!AL32=0,'BUDGET VS ACTUAL'!AF32,'BUDGET VS ACTUAL'!AL32)","v":0},{"$f":"'BUDGET VS ACTUAL'!AM32","v":0},{"$f":"H32-F32","v":0}]
[null,null,"Totaal",null,{"$f":"SUM(E29:E32)","v":0},{"$f":"SUM(F29:F32)","v":0},0,{"$f":"SUM(H29:H32)","v":0},{"$f":"AVERAGE(I29:I32)","v":0},{"$f":"H33-F33","v":0}]
[null,null,"Directe werkingskosten**"]
[null,null,{"$f":"'BUDGET VS ACTUAL'!P35","v":"Kies uit lijst Directe Werkingskosten"},{"$f":"'BUDGET VS ACTUAL'!Q35","v":" "},{"$f":"'BUDGET VS ACTUAL'!V35","v":0},{"$f":"'BUDGET VS ACTUAL'!W35","v":0},0,{"$f":"IF('BUDGET VS ACTUAL'!AL35=0,'BUDGET VS ACTUAL'!AF35,'BUDGET VS ACTUAL'!AL35)","v":0},{"$f":"'BUDGET VS ACTUAL'!AM35","v":0},{"$f":"H35-F35","v":0}]
[null,null,{"$f":"'BUDGET VS ACTUAL'!P36","v":"Kies uit lijst Directe Werkingskosten"},{"$f":"'BUDGET VS ACTUAL'!Q36","v":" "},{"$f":"'BUDGET VS ACTUAL'!V36","v":0},{"$f":"'BUDGET VS ACTUAL'!W36","v":0},0,{"$f":"IF('BUDGET VS ACTUAL'!AL36=0,'BUDGET VS ACTUAL'!AF36,'BUDGET VS ACTUAL'!AL36)","v":0},{"$f":"'BUDGET VS ACTUAL'!AM36","v":0},0]
[null,null,{"$f":"'BUDGET VS ACTUAL'!P37","v":"Kies uit lijst Directe Werkingskosten"},{"$f":"'BUDGET VS ACTUAL'!Q37","v":" "},{"$f":"'BUDGET VS ACTUAL'!V37","v":0},{"$f":"'BUDGET VS ACTUAL'!W37","v":0},0,{"$f":"IF('BUDGET VS ACTUAL'!AL37=0,'BUDGET VS ACTUAL'!AF37,'BUDGET VS ACTUAL'!AL37)","v":0},{"$f":"'BUDGET VS ACTUAL'!AM37","v":0},0]
[null,null,{"$f":"'BUDGET VS ACTUAL'!P38","v":"Kies uit lijst Directe Werkingskosten"},{"$f":"'BUDGET VS ACTUAL'!Q38","v":" "},{"$f":"'BUDGET VS ACTUAL'!V38","v":0},{"$f":"'BUDGET VS ACTUAL'!W38","v":0},0,{"$f":"IF('BUDGET VS ACTUAL'!AL38=0,'BUDGET VS ACTUAL'!AF38,'BUDGET VS ACTUAL'!AL38)","v":0},{"$f":"'BUDGET VS ACTUAL'!AM38","v":0},0]
[null,null,{"$f":"'BUDGET VS ACTUAL'!P39","v":"Kies uit lijst Directe Werkingskosten"},{"$f":"'BUDGET VS ACTUAL'!Q39","v":" "},{"$f":"'BUDGET VS ACTUAL'!V39","v":0},{"$f":"'BUDGET VS ACTUAL'!W39","v":0},0,{"$f":"IF('BUDGET VS ACTUAL'!AL39=0,'BUDGET VS ACTUAL'!AF39,'BUDGET VS ACTUAL'!AL39)","v":0},{"$f":"'BUDGET VS ACTUAL'!AM39","v":0},0]
[null,null,{"$f":"'BUDGET VS ACTUAL'!P40","v":"Kies uit lijst Directe Werkingskosten"},{"$f":"'BUDGET VS ACTUAL'!Q40","v":" "},{"$f":"'BUDGET VS ACTUAL'!V40","v":0},{"$f":"'BUDGET VS ACTUAL'!W40","v":0},0,{"$f":"IF('BUDGET VS ACTUAL'!AL40=0,'BUDGET VS ACTUAL'!AF40,'BUDGET VS ACTUAL'!AL40)","v":0},{"$f":"'BUDGET VS ACTUAL'!AM40","v":0},0]
[null,null,{"$f":"'BUDGET VS ACTUAL'!P41","v":"Kies uit lijst Directe Werkingskosten"},{"$f":"'BUDGET VS ACTUAL'!Q41","v":" "},{"$f":"'BUDGET VS ACTUAL'!V41","v":0},{"$f":"'BUDGET VS ACTUAL'!W41","v":0},0,{"$f":"IF('BUDGET VS ACTUAL'!AL41=0,'BUDGET VS ACTUAL'!AF41,'BUDGET VS ACTUAL'!AL41)","v":0},{"$f":"'BUDGET VS ACTUAL'!AM41","v":0},0]
[null,null,{"$f":"'BUDGET VS ACTUAL'!P42","v":"Kies uit lijst Directe Werkingskosten"},{"$f":"'BUDGET VS ACTUAL'!Q42","v":" "},{"$f":"'BUDGET VS ACTUAL'!V42","v":0},{"$f":"'BUDGET VS ACTUAL'!W42","v":0},0,{"$f":"IF('BUDGET VS ACTUAL'!AL42=0,'BUDGET VS ACTUAL'!AF42,'BUDGET VS ACTUAL'!AL42)","v":0},{"$f":"'BUDGET VS ACTUAL'!AM42","v":0},0]
[null,null,{"$f":"'BUDGET VS ACTUAL'!P43","v":"Kies uit lijst Directe Werkingskosten"},{"$f":"'BUDGET VS ACTUAL'!Q43","v":" "},{"$f":"'BUDGET VS ACTUAL'!V43","v":0},{"$f":"'BUDGET VS ACTUAL'!W43","v":0},0,{"$f":"IF('BUDGET VS ACTUAL'!AL43=0,'BUDGET VS ACTUAL'!AF43,'BUDGET VS ACTUAL'!AL43)","v":0},{"$f":"'BUDGET VS ACTUAL'!AM43","v":0},0]
[null,null,{"$f":"'BUDGET VS ACTUAL'!P44","v":"Andere: (zelf in te vullen)"},{"$f":"'BUDGET VS ACTUAL'!Q44","v":" "},{"$f":"'BUDGET VS ACTUAL'!V44","v":0},{"$f":"'BUDGET VS ACTUAL'!W44","v":0},0,{"$f":"IF('BUDGET VS ACTUAL'!AL44=0,'BUDGET VS ACTUAL'!AF44,'BUDGET VS ACTUAL'!AL44)","v":0},{"$f":"'BUDGET VS ACTUAL'!AM44","v":0},0]
[null,null,{"$f":"'BUDGET VS ACTUAL'!P45","v":"Andere: (zelf in te vullen)"},{"$f":"'BUDGET VS ACTUAL'!Q45","v":" "},{"$f":"'BUDGET VS ACTUAL'!V45","v":0},{"$f":"'BUDGET VS ACTUAL'!W45","v":0},0,{"$f":"IF('BUDGET VS ACTUAL'!AL45=0,'BUDGET VS ACTUAL'!AF45,'BUDGET VS ACTUAL'!AL45)","v":0},{"$f":"'BUDGET VS ACTUAL'!AM45","v":0},{"$f":"H45-F45","v":0}]
[null,null,"Totaal",null,{"$f":"SUM(E35:E45)","v":0},{"$f":"SUM(F35:F45)","v":0},{"$f":"IF(E46=0,0,F46/E46)","v":0},{"$f":"SUM(H35:H45)","v":0},{"$f":"AVERAGE(I35:I45)","v":0},{"$f":"H46-F46","v":0}]
[null,null,"Indirecte werkingskosten***"]
[null,null,{"$f":"'BUDGET VS ACTUAL'!P48","v":"Kies uit lijst Indirecte Werkingskosten"},null,{"$f":"'BUDGET VS ACTUAL'!V48","v":0},{"$f":"'BUDGET VS ACTUAL'!W48","v":0},0,{"$f":"IF('BUDGET VS ACTUAL'!AL48=0,'BUDGET VS ACTUAL'!AF48,'BUDGET VS ACTUAL'!AL48)","v":0},{"$f":"'BUDGET VS ACTUAL'!AM48","v":0},{"$f":"H48-F48","v":0}]
[null,null,{"$f":"'BUDGET VS ACTUAL'!P49","v":"Kies uit lijst Indirecte Werkingskosten"},null,{"$f":"'BUDGET VS ACTUAL'!V49","v":0},{"$f":"'BUDGET VS ACTUAL'!W49","v":0},0,{"$f":"IF('BUDGET VS ACTUAL'!AL49=0,'BUDGET VS ACTUAL'!AF49,'BUDGET VS ACTUAL'!AL49)","v":0},{"$f":"'BUDGET VS ACTUAL'!AM49","v":0},0]
[null,null,{"$f":"'BUDGET VS ACTUAL'!P50","v":"Kies uit lijst Indirecte Werkingskosten"},null,{"$f":"'BUDGET VS ACTUAL'!V50","v":0},{"$f":"'BUDGET VS ACTUAL'!W50","v":0},0,{"$f":"IF('BUDGET VS ACTUAL'!AL50=0,'BUDGET VS ACTUAL'!AF50,'BUDGET VS ACTUAL'!AL50)","v":0},{"$f":"'BUDGET VS ACTUAL'!AM50","v":0},0]
[null,null,{"$f":"'BUDGET VS ACTUAL'!P51","v":"Kies uit lijst Indirecte Werkingskosten"},null,{"$f":"'BUDGET VS ACTUAL'!V51","v":0},{"$f":"'BUDGET VS ACTUAL'!W51","v":0},0,{"$f":"IF('BUDGET VS ACTUAL'!AL51=0,'BUDGET VS ACTUAL'!AF51,'BUDGET VS ACTUAL'!AL51)","v":0},{"$f":"'BUDGET VS ACTUAL'!AM51","v":0},0]
[null,null,{"$f":"'BUDGET VS ACTUAL'!P52","v":"Kies uit lijst Indirecte Werkingskosten"},null,{"$f":"'BUDGET VS ACTUAL'!V52","v":0},{"$f":"'BUDGET VS ACTUAL'!W52","v":0},0,{"$f":"IF('BUDGET VS ACTUAL'!AL52=0,'BUDGET VS ACTUAL'!AF52,'BUDGET VS ACTUAL'!AL52)","v":0},{"$f":"'BUDGET VS ACTUAL'!AM52","v":0},0]
[null,null,{"$f":"'BUDGET VS ACTUAL'!P53","v":"Kies uit lijst Indirecte Werkingskosten"},null,{"$f":"'BUDGET VS ACTUAL'!V53","v":0},{"$f":"'BUDGET VS ACTUAL'!W53","v":0},0,{"$f":"IF('BUDGET VS ACTUAL'!AL53=0,'BUDGET VS ACTUAL'!AF53,'BUDGET VS ACTUAL'!AL53)","v":0},{"$f":"'BUDGET VS ACTUAL'!AM53","v":0},0]
[null,null,{"$f":"'BUDGET VS ACTUAL'!P54","v":"Kies uit lijst Indirecte Werkingskosten"},null,{"$f":"'BUDGET VS ACTUAL'!V54","v":0},{"$f":"'BUDGET VS ACTUAL'!W54","v":0},0,{"$f":"IF('BUDGET VS ACTUAL'!AL54=0,'BUDGET VS ACTUAL'!AF54,'BUDGET VS ACTUAL'!AL54)","v":0},{"$f":"'BUDGET VS ACTUAL'!AM54","v":0},0]
[null,null,{"$f":"'BUDGET VS ACTUAL'!P55","v":"Kies uit lijst Indirecte Werkingskosten"},null,{"$f":"'BUDGET VS ACTUAL'!V55","v":0},{"$f":"'BUDGET VS ACTUAL'!W55","v":0},0,{"$f":"IF('BUDGET VS ACTUAL'!AL55=0,'BUDGET VS ACTUAL'!AF55,'BUDGET VS ACTUAL'!AL55)","v":0},{"$f":"'BUDGET VS ACTUAL'!AM55","v":0},0]
[null,null,{"$f":"'BUDGET VS ACTUAL'!P56","v":"Kies uit lijst Indirecte Werkingskosten"},null,{"$f":"'BUDGET VS ACTUAL'!V56","v":0},{"$f":"'BUDGET VS ACTUAL'!W56","v":0},0,{"$f":"IF('BUDGET VS ACTUAL'!AL56=0,'BUDGET VS ACTUAL'!AF56,'BUDGET VS ACTUAL'!AL56)","v":0},{"$f":"'BUDGET VS ACTUAL'!AM56","v":0},0]
[null,null,{"$f":"'BUDGET VS ACTUAL'!P57","v":"Andere: (zelf in te vullen)"},null,{"$f":"'BUDGET VS ACTUAL'!V57","v":0},{"$f":"'BUDGET VS ACTUAL'!W57","v":0},0,{"$f":"IF('BUDGET VS ACTUAL'!AL57=0,'BUDGET VS ACTUAL'!AF57,'BUDGET VS ACTUAL'!AL57)","v":0},{"$f":"'BUDGET VS ACTUAL'!AM57","v":0},0]
[null,null,{"$f":"'BUDGET VS ACTUAL'!P58","v":"Andere: (zelf in te vullen)"},null,{"$f":"'BUDGET VS ACTUAL'!V58","v":0},{"$f":"'BUDGET VS ACTUAL'!W58","v":0},0,{"$f":"IF('BUDGET VS ACTUAL'!AL58=0,'BUDGET VS ACTUAL'!AF58,'BUDGET VS ACTUAL'!AL58)","v":0},{"$f":"'BUDGET VS ACTUAL'!AM58","v":0},{"$f":"H58-F58","v":0}]
[null,null,"Totaal",null,{"$f":"SUM(E48:E58)","v":0},{"$f":"SUM(F48:F58)","v":0},{"$f":"IF(E59=0,0,F59/E59)","v":0},{"$f":"SUM(H48:H58)","v":0},{"$f":"AVERAGE(I48:I58)","v":0},{"$f":"H59-F59","v":0}]
[null,null,"TOTAAL",null,{"$f":"E24+E27+E33+E46+E59","v":0},{"$f":"F24+F27+F33+F46+F59","v":0},{"$f":"IF(E60=0,0,F60/E60)","v":0},{"$f":"H24+H27+H33+H46+H59","v":0},{"$f":"AVERAGE(I52:I59)","v":0},{"$f":"IF(E60=0,0,I60/E60)","v":0}]
[]
[null,null,null,null,null,"VERSCHIL TUSSEN BUDGET EN FINANCIERING"]

{"sheet":"BUDGET VS ACTUAL","index":19,"n_rows":77,"n_cols":41,"rows_kept":77,"cut":false,"hidden":true,"merged":[[74,35,74,36],[74,29,74,30],[12,35,12,40],[66,35,66,40],[67,35,67,36],[68,35,68,36],[69,35,69,36],[70,35,70,36],[71,35,71,36],[72,35,72,36],[73,35,73,36],[68,29,68,30],[69,29,69,30],[70,29,70,30],[73,29,73,30],[12,29,12,34],[59,4,59,8],[76,4,76,7],[12,16,12,25],[59,17,59,21],[76,17,76,20],[66,3,66,12],[66,16,66,25],[12,3,12,12],[34,16,34,17],[35,16,35,17],[36,16,36,17],[37,16,37,17],[38,16,38,17],[39,16,39,17],[40,16,40,17],[41,16,41,17],[3,10,3,12],[3,23,3,26],[11,29,11,40],[8,3,8,12],[9,3,9,12],[11,3,11,12],[8,16,8,25],[9,16,9,25],[10,16,10,25],[11,16,11,25],[10,3,10,12],[66,29,66,34],[67,29,67,30],[72,29,72,30],[71,29,71,30],[4,10,4,12],[5,10,5,12],[42,16,42,17],[43,16,43,17],[44,16,44,17]]}
[]
[]
[]
[null,null,null,null,null,null,null,null,null,null,"GOEDGEKEURD INI BUDGET",null,null,null,null,null,null,null,null,null,null,null,null,"GOEDGEKEURD BUDGET AJU"]
[]
[]
[null,null,null,null,"Kies uit lijst Indirecte Werkingskosten"]
[]
[null,null,"Begunstigde:",{"$f":"'GOEDGEKEURD INI BUDGET'!E9","v":0},null,null,null,null,null,null,null,null,null,null,null,"Begunstigde:",{"$f":"D9","v":0}]
[null,null,"Project:",{"$f":"'GOEDGEKEURD INI BUDGET'!E10","v":0},null,null,null,null,null,null,null,null,null,null,null,"Project:",{"$f":"D10","v":0}]
[null,null,"Contactpersoon",{"$f":"'GOEDGEKEURD INI BUDGET'!E11","v":0},null,null,null,null,null,null,null,null,null,null,null,"Contactpersoon",0]
[null,null,"Looptijd project (aantal maanden):",{"$f":"'GOEDGEKEURD INI BUDGET'!E12","v":0},null,null,null,null,null,null,null,null,null,null,null,"Looptijd project (aantal maanden):",0]
[null,null,null,null,null,null,null,null,null,null,null,null,null,null,null,null,"BUDGET AJU**",null,null,null,null,null,null,null,null,null,null,null,null,"TUSSENTIJDSE UITGAVEN ",null,null,null,null,null,"REELE UITGAVEN"]
[null,null,{"$f":"'GOEDGEKEURD INI BUDGET'!C16","v":"Budget 2021"},"VTE","Eenheidskost (per maand)","Eenheidskost (per jaar)","Aantal maanden project","% van de tijd aan het project","Totaal bedrag project","Goedgekeurd Fedasil (project of activiteit)","% Fedasil","Andere financieringsbronnen","% andere bronnen",null,null,{"$f":"'GOEDGEKEURD BUDGET AJU'!C13","v":"Budget 2021"},"VTE","Eenheidskost (per maand)","Eenheidskost (per jaar)","Aantal maanden project","% van de tijd aan het project","Totaal bedrag project","Goedgekeurd Fedasil (project of activiteit)","% Fedasil","Andere financieringsbronnen","% andere bronnen",null,null,null,"Project gerealiseerd","Gerealiseerd %","Fedasil reële uitgaven ","Fedasil gereali-seerd % ","Andere financierings-bronnen reële uitgaven","% andere bronnen","Project gerealiseerd","Gerealiseerd %","Fedasil reële uitgaven ","Fedasil gereali-seerd % ","Andere financierings-bronnen reële uitgaven","% andere bronnen"]
[null,null,"Personeel",null,null,null,null,null,null,null,null,null,null,null,null,"Personeel",null,null,null,null,null,null,null,null,null,null,null,null,null,"(stap1)",null,"(stap2)",null,null,null,"(stap1)",null,"(stap2)"]
[null,null,"(naam in te vullen)",0,0,{"$f":"+E16*12","v":0},0,0,{"$f":"H16*G16*E16","v":0},0,{"$f":"IF(I16=0,0,J16/I16)","v":0},{"$f":"I16-J16","v":0},{"$f":"IF(I16=0,0,L16/I16)","v":0},null,null,{"$f":"'GOEDGEKEURD BUDGET AJU'!C15","v":"(naam in te vullen)"},{"$f":"'GOEDGEKEURD BUDGET AJU'!E15","v":0},{"$f":"'GOEDGEKEURD BUDGET AJU'!F15","v":0},{"$f":"'GOEDGEKEURD BUDGET AJU'!G15","v":0},{"$f":"'GOEDGEKEURD BUDGET AJU'!H15","v":0},{"$f":"'GOEDGEKEURD BUDGET AJU'!I15","v":0},{"$f":"'AANVRAAG BUDGET AJU'!R19","v":0},{"$f":"'GOEDGEKEURD BUDGET AJU'!K15","v":0},{"$f":"'GOEDGEKEURD BUDGET AJU'!L15","v":0},{"$f":"'GOEDGEKEURD BUDGET AJU'!M15","v":0},{"$f":"'GOEDGEKEURD BUDGET AJU'!N15","v":0},null,null,null,{"$f":"AF16+AH16","v":0},{"$f":"IF(I16=0,0,AD16/I16)","v":0},{"$f":"Personeelskosten!N20","v":0},{"$f":"IF(AD16=0,0,AF16/AD16)","v":0},{"$f":"Personeelskosten!L20-Personeelskosten!N20","v":0},{"$f":"IF(AD16=0,0,AH16/AD16)","v":0},{"$f":"AL16+AN16","v":0},{"$f":"IF(V16=0,0,AJ16/V16)","v":0},{"$f":"Personeelskosten!T20","v":0},{"$f":"IF(AJ16=0,0,AL16/AJ16)","v":0},{"$f":"Personeelskosten!L20-Personeelskosten!N20","v":0},{"$f":"IF(AJ16=0,0,AN16/AJ16)","v":0}]
[null,null,"(naam in te vullen)",0,0,{"$f":"+E17*12","v":0},0,0,{"$f":"H17*G17*E17","v":0},0,{"$f":"IF(I17=0,0,J17/I17)","v":0},{"$f":"I17-J17","v":0},{"$f":"IF(I17=0,0,L17/I17)","v":0},null,null,{"$f":"'GOEDGEKEURD BUDGET AJU'!C16","v":"(naam in te vullen)"},{"$f":"'GOEDGEKEURD BUDGET AJU'!E16","v":0},{"$f":"'GOEDGEKEURD BUDGET AJU'!F16","v":0},{"$f":"'GOEDGEKEURD BUDGET AJU'!G16","v":0},{"$f":"'GOEDGEKEURD BUDGET AJU'!H16","v":0},{"$f":"'GOEDGEKEURD BUDGET AJU'!I16","v":0},{"$f":"'AANVRAAG BUDGET AJU'!R20","v":0},{"$f":"'GOEDGEKEURD BUDGET AJU'!K16","v":0},{"$f":"'GOEDGEKEURD BUDGET AJU'!L16","v":0},{"$f":"'GOEDGEKEURD BUDGET AJU'!M16","v":0},{"$f":"'GOEDGEKEURD BUDGET AJU'!N16","v":0},null,null,null,{"$f":"AF17+AH17","v":0},0,{"$f":"Personeelskosten!N36","v":0},{"$f":"IF(AD17=0,0,AF17/AD17)","v":0},{"$f":"Personeelskosten!L21-Personeelskosten!N21","v":0},{"$f":"IF(AD17=0,0,AH17/AD17)","v":0},{"$f":"AL17+AN17","v":0},{"$f":"IF(V17=0,0,AJ17/V17)","v":0},{"$f":"Personeelskosten!T36","v":0},{"$f":"IF(AJ17=0,0,AL17/AJ17)","v":0},{"$f":"Personeelskosten!L21-Personeelskosten!N21","v":0},{"$f":"IF(AJ17=0,0,AN17/AJ17)","v":0}]
[null,null,"(naam in te vullen)",0,0,0,0,0,0,0,{"$f":"IF(I18=0,0,J18/I18)","v":0},0,{"$f":"IF(I18=0,0,L18/I18)","v":0},null,null,{"$f":"'GOEDGEKEURD BUDGET AJU'!C17","v":"(naam in te vullen)"},{"$f":"'GOEDGEKEURD BUDGET AJU'!E17","v":0},{"$f":"'GOEDGEKEURD BUDGET AJU'!F17","v":0},{"$f":"'GOEDGEKEURD BUDGET AJU'!G17","v":0},{"$f":"'GOEDGEKEURD BUDGET AJU'!H17","v":0},{"$f":"'GOEDGEKEURD BUDGET AJU'!I17","v":0},{"$f":"'AANVRAAG BUDGET AJU'!R21","v":0},{"$f":"'GOEDGEKEURD BUDGET AJU'!K17","v":0},{"$f":"'GOEDGEKEURD BUDGET AJU'!L17","v":0},{"$f":"'GOEDGEKEURD BUDGET AJU'!M17","v":0},{"$f":"'GOEDGEKEURD BUDGET AJU'!N17","v":0},null,null,null,0,0,{"$f":"Personeelskosten!N52","v":0},0,{"$f":"Personeelskosten!L22-Personeelskosten!N22","v":0},0,{"$f":"AL18+AN18","v":0},0,{"$f":"Personeelskosten!T52","v":0},0,{"$f":"Personeelskosten!L22-Personeelskosten!N22","v":0},0]
[null,null,"(naam in te vullen)",0,0,0,0,0,0,0,0,0,0,null,null,{"$f":"'GOEDGEKEURD BUDGET AJU'!C18","v":"(naam in te vullen)"},{"$f":"'GOEDGEKEURD BUDGET AJU'!E18","v":0},{"$f":"'GOEDGEKEURD BUDGET AJU'!F18","v":0},{"$f":"'GOEDGEKEURD BUDGET AJU'!G18","v":0},{"$f":"'GOEDGEKEURD BUDGET AJU'!H18","v":0},{"$f":"'GOEDGEKEURD BUDGET AJU'!I18","v":0},{"$f":"'AANVRAAG BUDGET AJU'!R22","v":0},{"$f":"'GOEDGEKEURD BUDGET AJU'!K18","v":0},{"$f":"'GOEDGEKEURD BUDGET AJU'!L18","v":0},{"$f":"'GOEDGEKEURD BUDGET AJU'!M18","v":0},{"$f":"'GOEDGEKEURD BUDGET AJU'!N18","v":0},null,null,null,0,0,{"$f":"Personeelskosten!N68","v":0},0,{"$f":"Personeelskosten!L23-Personeelskosten!N23","v":0},0,0,0,{"$f":"Personeelskosten!T68","v":0},0,{"$f":"Personeelskosten!L23-Personeelskosten!N23","v":0},0]
[null,null,"(naam in te vullen)",0,0,0,0,0,0,0,0,0,0,null,null,{"$f":"'GOEDGEKEURD BUDGET AJU'!C19","v":"(naam in te vullen)"},{"$f":"'GOEDGEKEURD BUDGET AJU'!E19","v":0},{"$f":"'GOEDGEKEURD BUDGET AJU'!F19","v":0},{"$f":"'GOEDGEKEURD BUDGET AJU'!G19","v":0},{"$f":"'GOEDGEKEURD BUDGET AJU'!H19","v":0},{"$f":"'GOEDGEKEURD BUDGET AJU'!I19","v":0},{"$f":"'AANVRAAG BUDGET AJU'!R23","v":0},{"$f":"'GOEDGEKEURD BUDGET AJU'!K19","v":0},{"$f":"'GOEDGEKEURD BUDGET AJU'!L19","v":0},{"$f":"'GOEDGEKEURD BUDGET AJU'!M19","v":0},{"$f":"'GOEDGEKEURD BUDGET AJU'!N19","v":0},null,null,null,0,0,{"$f":"Personeelskosten!N84","v":0},0,{"$f":"Personeelskosten!L24-Personeelskosten!N24","v":0},0,0,0,{"$f":"Personeelskosten!T84","v":0},0,{"$f":"Personeelskosten!L24-Personeelskosten!N24","v":0},0]
[null,null,"(naam in te vullen)",0,0,0,0,0,0,0,0,0,0,null,null,{"$f":"'GOEDGEKEURD BUDGET AJU'!C20","v":"(naam in te vullen)"},{"$f":"'GOEDGEKEURD BUDGET AJU'!E20","v":0},{"$f":"'GOEDGEKEURD BUDGET AJU'!F20","v":0},{"$f":"'GOEDGEKEURD BUDGET AJU'!G20","v":0},{"$f":"'GOEDGEKEURD BUDGET AJU'!H20","v":0},{"$f":"'GOEDGEKEURD BUDGET AJU'!I20","v":0},{"$f":"'AANVRAAG BUDGET AJU'!R24","v":0},{"$f":"'GOEDGEKEURD BUDGET AJU'!K20","v":0},{"$f":"'GOEDGEKEURD BUDGET AJU'!L20","v":0},{"$f":"'GOEDGEKEURD BUDGET AJU'!M20","v":0},{"$f":"'GOEDGEKEURD BUDGET AJU'!N20","v":0},null,null,null,0,0,{"$f":"Personeelskosten!N100","v":0},0,{"$f":"Personeelskosten!L25-Personeelskosten!N25","v":0},0,0,0,{"$f":"Personeelskosten!T100","v":0},0,{"$f":"Personeelskosten!L25-Personeelskosten!N25","v":0},0]
[null,null,"(naam in te vullen)",0,0,0,0,0,0,0,0,0,0,null,null,{"$f":"'GOEDGEKEURD BUDGET AJU'!C21","v":"(naam in te vullen)"},{"$f":"'GOEDGEKEURD BUDGET AJU'!E21","v":0},{"$f":"'GOEDGEKEURD BUDGET AJU'!F21","v":0},{"$f":"'GOEDGEKEURD BUDGET AJU'!G21","v":0},{"$f":"'GOEDGEKEURD BUDGET AJU'!H21","v":0},{"$f":"'GOEDGEKEURD BUDGET AJU'!I21","v":0},{"$f":"'AANVRAAG BUDGET AJU'!R25","v":0},{"$f":"'GOEDGEKEURD BUDGET AJU'!K21","v":0},{"$f":"'GOEDGEKEURD BUDGET AJU'!L21","v":0},{"$f":"'GOEDGEKEURD BUDGET AJU'!M21","v":0},{"$f":"'GOEDGEKEURD BUDGET AJU'!N21","v":0},null,null,null,0,0,{"$f":"Personeelskosten!N116","v":0},0,{"$f":"Personeelskosten!L26-Personeelskosten!N26","v":0},0,0,0,{"$f":"Personeelskosten!T116","v":0},0,{"$f":"Personeelskosten!L26-Personeelskosten!N26","v":0},0]
[null,null,"(naam in te vullen)",0,0,0,0,0,0,0,0,0,0,null,null,{"$f":"'GOEDGEKEURD BUDGET AJU'!C22","v":"(naam in te vullen)"},{"$f":"'GOEDGEKEURD BUDGET AJU'!E22","v":0},{"$f":"'GOEDGEKEURD BUDGET AJU'!F22","v":0},{"$f":"'GOEDGEKEURD BUDGET AJU'!G22","v":0},{"$f":"'GOEDGEKEURD BUDGET AJU'!H22","v":0},{"$f":"'GOEDGEKEURD BUDGET AJU'!I22","v":0},{"$f":"'AANVRAAG BUDGET AJU'!R26","v":0},{"$f":"'GOEDGEKEURD BUDGET AJU'!K22","v":0},{"$f":"'GOEDGEKEURD BUDGET AJU'!L22","v":0},{"$f":"'GOEDGEKEURD BUDGET AJU'!M22","v":0},{"$f":"'GOEDGEKEURD BUDGET AJU'!N22","v":0},null,null,null,{"$f":"AF23+AH23","v":0},0,{"$f":"Personeelskosten!N132","v":0},0,{"$f":"Personeelskosten!L27-Personeelskosten!N27","v":0},0,0,0,{"$f":"Personeelskosten!T132","v":0},0,{"$f":"Personeelskosten!L27-Personeelskosten!N27","v":0},0]
[null,null,"Totaal",{"$f":"SUM(D16:D23)","v":0},null,{"$f":"SUM(F16:F23)","v":0},null,null,{"$f":"SUM(I16:I23)","v":0},{"$f":"SUM(J16:J23)","v":0},{"$f":"IF(I24=0,0,J24/I24)","v":0},{"$f":"SUM(L16:L23)","v":0},{"$f":"IF(I24=0,0,L24/I24)","v":0},null,null,"Totaal",{"$f":"SUM(Q16:Q23)","v":0},null,{"$f":"SUM(S16:S23)","v":0},null,null,{"$f":"SUM(V16:V23)","v":0},{"$f":"SUM(W16:W23)","v":0},{"$f":"IF(V24=0,0,W24/V24)","v":0},{"$f":"SUM(Y16:Y23)","v":0},{"$f":"IF(V24=0,0,Y24/V24)","v":0},null,null,null,{"$f":"SUM(AD16:AD23)","v":0},0,{"$f":"SUM(AF16:AF23)","v":0},{"$f":"IF(AD24=0,0,AF24/AD24)","v":0},{"$f":"SUM(AH16:AH23)","v":0},{"$f":"IF(AD24=0,0,AH24/AD24)","v":0},{"$f":"SUM(AJ16:AJ23)","v":0},{"$f":"IF(I24=0,0,AJ24/I24)","v":0},{"$f":"SUM(AL16:AL23)","v":0},{"$f":"IF(AJ24=0,0,AL24/AJ24)","v":0},{"$f":"SUM(AN16:AN23)","v":0},{"$f":"IF(AJ24=0,0,AN24/AJ24)","v":0}]
[null,null,"Huur",null,null,null,null,null,null,null,null,null,null,null,null,"Huur"]
[null,null,"(Voorwerp/Gebouw & Adres in te vullen)",null,0,{"$f":"+E26*12","v":0},0,0,{"$f":"H26*G26*E26","v":0},0,{"$f":"IF(I26=0,0,J26/I26)","v":0},{"$f":"I26-J26","v":0},{"$f":"IF(I26=0,0,L26/I26)","v":0},null,null,{"$f":"'GOEDGEKEURD BUDGET AJU'!C25","v":"(Voorwerp/Gebouw & Adres in te vullen)"},null,{"$f":"'GOEDGEKEURD BUDGET AJU'!F25","v":0},{"$f":"'GOEDGEKEURD BUDGET AJU'!G25","v":0},{"$f":"'GOEDGEKEURD BUDGET AJU'!H25","v":0},{"$f":"'GOEDGEKEURD BUDGET AJU'!I25","v":0},{"$f":"'AANVRAAG BUDGET AJU'!R29","v":0},{"$f":"'GOEDGEKEURD BUDGET AJU'!K25","v":0},{"$f":"'GOEDGEKEURD BUDGET AJU'!L25","v":0},{"$f":"'GOEDGEKEURD BUDGET AJU'!M25","v":0},{"$f":"'GOEDGEKEURD BUDGET AJU'!N25","v":0},null,null,null,{"$f":"AF26+AH26","v":0},{"$f":"IF(I26=0,0,AD26/I26)","v":0},{"$f":"Huur!H18","v":0},{"$f":"IF(AD26=0,0,AF26/AD26)","v":0},{"$f":"Huur!J18","v":0},{"$f":"IF(AD26=0,0,AH26/AD26)","v":0},{"$f":"AL26+AN26","v":0},{"$f":"IF(V26=0,0,AJ26/V26)","v":0},{"$f":"Huur!H18","v":0},{"$f":"IF(AJ26=0,0,AL26/AJ26)","v":0},{"$f":"Huur!J18","v":0},{"$f":"IF(AJ26=0,0,AN26/AJ26)","v":0}]
[null,null,"Totaal",null,null,{"$f":"SUM(F26:F26)","v":0},null,null,{"$f":"SUM(I26:I26)","v":0},{"$f":"SUM(J26)","v":0},{"$f":"IF(I27=0,0,J27/I27)","v":0},{"$f":"SUM(L26:L26)","v":0},{"$f":"IF(I27=0,0,L27/I27)","v":0},null,null,"Totaal",null,null,{"$f":"SUM(S26:S26)","v":0},null,null,{"$f":"SUM(V26:V26)","v":0},{"$f":"SUM(W26)","v":0},{"$f":"IF(V27=0,0,W27/V27)","v":0},{"$f":"SUM(Y26:Y26)","v":0},{"$f":"IF(V27=0,0,Y27/V27)","v":0},null,null,null,{"$f":"SUM(AD26:AD26)","v":0},{"$f":"IF(I27=0,0,AD27/I27)","v":0},{"$f":"SUM(AF26:AF26)","v":0},{"$f":"IF(AD27=0,0,AF27/AD27)","v":0},{"$f":"SUM(AH26:AH26)","v":0},{"$f":"IF(AD27=0,0,AH27/AD27)","v":0},{"$f":"SUM(AJ26:AJ26)","v":0},{"$f":"IF(I27=0,0,AJ27/I27)","v":0},{"$f":"SUM(AL26:AL26)","v":0},{"$f":"IF(AJ27=0,0,AL27/AJ27)","v":0},{"$f":"SUM(AN26:AN26)","v":0},{"$f":"IF(AJ27=0,0,AN27/AJ27)","v":0}]
[null,null,"Investeringen (vb. hard-en/of software) ",null,null,null,null,null,null,null,null,null,null,null,null,"Investeringen (vb. hard-en/of software) "]
[null,null,"(Beschrijving in te vullen)",null,null,0,null,0,{"$f":"H29*G29*E29","v":0},0,{"$f":"IF(I29=0,0,J29/I29)","v":0},{"$f":"I29-J29","v":0},{"$f":"IF(I29=0,0,L29/I29)","v":0},null,null,{"$f":"'GOEDGEKEURD BUDGET AJU'!C28","v":"(Beschrijving in te vullen)"},null,null,{"$f":"'GOEDGEKEURD BUDGET AJU'!G28","v":0},null,{"$f":"'GOEDGEKEURD BUDGET AJU'!I28","v":0},{"$f":"'AANVRAAG BUDGET AJU'!R33","v":0},{"$f":"'GOEDGEKEURD BUDGET AJU'!K28","v":0},{"$f":"'GOEDGEKEURD BUDGET AJU'!L28","v":0},{"$f":"'GOEDGEKEURD BUDGET AJU'!M28","v":0},{"$f":"'GOEDGEKEURD BUDGET AJU'!N28","v":0},null,null,null,{"$f":"AF29+AH29","v":0},{"$f":"IF(I29=0,0,AD29/I29)","v":0},{"$f":"Investeringen!K6","v":0},{"$f":"IF(AD29=0,0,AF29/AD29)","v":0},{"$f":"Investeringen!M6","v":0},{"$f":"IF(AD29=0,0,AH29/AD29)","v":0},{"$f":"AL29+AN29","v":0},{"$f":"IF(V29=0,0,AJ29/V29)","v":0},{"$f":"Investeringen!K6","v":0},{"$f":"IF(AJ29=0,0,AL29/AJ29)","v":0},{"$f":"Investeringen!L6","v":0},{"$f":"IF(AJ29=0,0,AN29/AJ29)","v":0}]
[null,null,"(in te vullen)",null,null,0,null,0,{"$f":"H30*G30*E30","v":0},0,{"$f":"IF(I30=0,0,J30/I30)","v":0},{"$f":"I30-J30","v":0},{"$f":"IF(I30=0,0,L30/I30)","v":0},null,null,{"$f":"'GOEDGEKEURD BUDGET AJU'!C29","v":"(in te vullen)"},null,null,{"$f":"'GOEDGEKEURD BUDGET AJU'!G29","v":0},null,{"$f":"'GOEDGEKEURD BUDGET AJU'!I29","v":0},{"$f":"'AANVRAAG BUDGET AJU'!R34","v":0},{"$f":"'GOEDGEKEURD BUDGET AJU'!K29","v":0},{"$f":"'GOEDGEKEURD BUDGET AJU'!L29","v":0},{"$f":"'GOEDGEKEURD BUDGET AJU'!M29","v":0},{"$f":"'GOEDGEKEURD BUDGET AJU'!N29","v":0},null,null,null,{"$f":"AF30+AH30","v":0},{"$f":"IF(I30=0,0,AD30/I30)","v":0},{"$f":"Investeringen!K7","v":0},{"$f":"IF(AD30=0,0,AF30/AD30)","v":0},{"$f":"Investeringen!M7","v":0},{"$f":"IF(AD30=0,0,AH30/AD30)","v":0},{"$f":"AL30+AN30","v":0},{"$f":"IF(V30=0,0,AJ30/V30)","v":0},{"$f":"Investeringen!K7","v":0},{"$f":"IF(AJ30=0,0,AL30/AJ30)","v":0},{"$f":"Investeringen!L7","v":0},{"$f":"IF(AJ30=0,0,AN30/AJ30)","v":0}]
[null,null,"(in te vullen)",null,null,0,null,0,0,0,0,0,0,null,null,{"$f":"'GOEDGEKEURD BUDGET AJU'!C30","v":"(in te vullen)"},null,null,{"$f":"'GOEDGEKEURD BUDGET AJU'!G30","v":0},null,{"$f":"'GOEDGEKEURD BUDGET AJU'!I30","v":0},{"$f":"'AANVRAAG BUDGET AJU'!R35","v":0},{"$f":"'GOEDGEKEURD BUDGET AJU'!K30","v":0},{"$f":"'GOEDGEKEURD BUDGET AJU'!L30","v":0},{"$f":"'GOEDGEKEURD BUDGET AJU'!M30","v":0},{"$f":"'GOEDGEKEURD BUDGET AJU'!N30","v":0},null,null,null,{"$f":"AF31+AH31","v":0},{"$f":"IF(I31=0,0,AD31/I31)","v":0},{"$f":"Investeringen!K8","v":0},0,{"$f":"Investeringen!M8","v":0},0,0,0,{"$f":"Investeringen!K8","v":0},0,{"$f":"Investeringen!L8","v":0},0]
[null,null,"(in te vullen)",null,null,0,null,0,0,0,0,0,0,null,null,{"$f":"'GOEDGEKEURD BUDGET AJU'!C31","v":"(in te vullen)"},null,null,{"$f":"'GOEDGEKEURD BUDGET AJU'!G31","v":0},null,{"$f":"'GOEDGEKEURD BUDGET AJU'!I31","v":0},{"$f":"'AANVRAAG BUDGET AJU'!R36","v":0},{"$f":"'GOEDGEKEURD BUDGET AJU'!K31","v":0},{"$f":"'GOEDGEKEURD BUDGET AJU'!L31","v":0},{"$f":"'GOEDGEKEURD BUDGET AJU'!M31","v":0},{"$f":"'GOEDGEKEURD BUDGET AJU'!N31","v":0},null,null,null,0,{"$f":"IF(I32=0,0,AD32/I32)","v":0},{"$f":"Investeringen!K9","v":0},0,{"$f":"Investeringen!M9","v":0},0,0,0,{"$f":"Investeringen!K9","v":0},0,{"$f":"Investeringen!L9","v":0},0]
[null,null,"Totaal",null,null,{"$f":"SUM(F29:F32)","v":0},null,null,{"$f":"SUM(I29:I32)","v":0},{"$f":"SUM(J29:J32)","v":0},0,{"$f":"SUM(L29:L32)","v":0},0,null,null,"Totaal",null,null,{"$f":"SUM(S29:S32)","v":0},null,null,{"$f":"SUM(V29:V32)","v":0},{"$f":"SUM(W29:W32)","v":0},{"$f":"IF(V33=0,0,W33/V33)","v":0},{"$f":"SUM(Y29:Y32)","v":0},{"$f":"IF(V33=0,0,Y33/V33)","v":0},null,null,null,{"$f":"SUM(AD29:AD32)","v":0},{"$f":"IF(I33=0,0,AD33/I33)","v":0},{"$f":"SUM(AF29:AF32)","v":0},{"$f":"IF(AD33=0,0,AF33/AD33)","v":0},{"$f":"SUM(AH29:AH32)","v":0},{"$f":"IF(AD33=0,0,AH33/AD33)","v":0},{"$f":"SUM(AJ29:AJ32)","v":0},{"$f":"IF(I33=0,0,AJ33/I33)","v":0},{"$f":"SUM(AL29:AL32)","v":0},{"$f":"IF(AJ33=0,0,AL33/AJ33)","v":0},{"$f":"SUM(AN29:AN32)","v":0},{"$f":"IF(AJ33=0,0,AN33/AJ33)","v":0}]
[null,null,"Directe werkingskosten",null,null,null,null,null,null,null,null,null,null,null,null,"Directe werkingskosten"]
[null,null,"Kies uit lijst Directe Werkingskosten",null,null,0,null,null,{"$f":"H35*G35*E35","v":0},0,{"$f":"IF(I35=0,0,J35/I35)","v":0},{"$f":"I35-J35","v":0},{"$f":"IF(I35=0,0,L35/I35)","v":0},null,null,{"$f":"'GOEDGEKEURD BUDGET AJU'!C34","v":"Kies uit lijst Directe Werkingskosten"},{"$f":"'GOEDGEKEURD BUDGET AJU'!E34","v":" "},null,{"$f":"'GOEDGEKEURD BUDGET AJU'!G34","v":0},null,null,{"$f":"'AANVRAAG BUDGET AJU'!R40","v":0},{"$f":"'GOEDGEKEURD BUDGET AJU'!K34","v":0},{"$f":"'GOEDGEKEURD BUDGET AJU'!L34","v":0},{"$f":"'GOEDGEKEURD BUDGET AJU'!M34","v":0},{"$f":"'GOEDGEKEURD BUDGET AJU'!N34","v":0},null,null,null,{"$f":"AF35+AH35","v":0},{"$f":"IF(I35=0,0,AD35/I35)","v":0},{"$f":"'Directe werkingskosten'!I18","v":0},{"$f":"IF(AD35=0,0,AF35/AD35)","v":0},{"$f":"'Directe werkingskosten'!J18","v":0},{"$f":"IF(AD35=0,0,AH35/AD35)","v":0},{"$f":"AL35+AN35","v":0},{"$f":"IF(V35=0,0,AJ35/V35)","v":0},{"$f":"'Directe werkingskosten'!I18","v":0},{"$f":"IF(AJ35=0,0,AL35/AJ35)","v":0},{"$f":"'Directe werkingskosten'!J18","v":0},{"$f":"IF(AJ35=0,0,AN35/AJ35)","v":0}]
[null,null,"Kies uit lijst Directe Werkingskosten",null,null,0,null,null,{"$f":"H36*G36*E36","v":0},0,{"$f":"IF(I36=0,0,J36/I36)","v":0},{"$f":"I36-J36","v":0},{"$f":"IF(I36=0,0,L36/I36)","v":0},null,null,{"$f":"'GOEDGEKEURD BUDGET AJU'!C35","v":"Kies uit lijst Directe Werkingskosten"},{"$f":"'GOEDGEKEURD BUDGET AJU'!E35","v":" "},null,{"$f":"'GOEDGEKEURD BUDGET AJU'!G35","v":0},null,null,{"$f":"'AANVRAAG BUDGET AJU'!R41","v":0},{"$f":"'GOEDGEKEURD BUDGET AJU'!K35","v":0},{"$f":"'GOEDGEKEURD BUDGET AJU'!L35","v":0},{"$f":"'GOEDGEKEURD BUDGET AJU'!M35","v":0},{"$f":"'GOEDGEKEURD BUDGET AJU'!N35","v":0},null,null,null,{"$f":"AF36+AH36","v":0},0,{"$f":"'Directe werkingskosten'!I31","v":0},{"$f":"IF(AD36=0,0,AF36/AD36)","v":0},{"$f":"'Directe werkingskosten'!J31","v":0},0,{"$f":"AL36+AN36","v":0},{"$f":"IF(V36=0,0,AJ36/V36)","v":0},{"$f":"'Directe werkingskosten'!I31","v":0},{"$f":"IF(AJ36=0,0,AL36/AJ36)","v":0},{"$f":"'Directe werkingskosten'!J31","v":0},0]
[null,null,"Kies uit lijst Directe Werkingskosten",null,null,0,null,null,0,0,0,0,0,null,null,{"$f":"'GOEDGEKEURD BUDGET AJU'!C36","v":"Kies uit lijst Directe Werkingskosten"},{"$f":"'GOEDGEKEURD BUDGET AJU'!E36","v":" "},null,{"$f":"'GOEDGEKEURD BUDGET AJU'!G36","v":0},null,null,{"$f":"'AANVRAAG BUDGET AJU'!R42","v":0},{"$f":"'GOEDGEKEURD BUDGET AJU'!K36","v":0},{"$f":"'GOEDGEKEURD BUDGET AJU'!L36","v":0},{"$f":"'GOEDGEKEURD BUDGET AJU'!M36","v":0},{"$f":"'GOEDGEKEURD BUDGET AJU'!N36","v":0},null,null,null,0,0,{"$f":"'Directe werkingskosten'!I44","v":0},0,{"$f":"'Directe werkingskosten'!J44","v":0},0,0,0,{"$f":"'Directe werkingskosten'!I44","v":0},0,{"$f":"'Directe werkingskosten'!J44","v":0},0]
[null,null,"Kies uit lijst Directe Werkingskosten",null,null,0,null,null,0,0,0,0,0,null,null,{"$f":"'GOEDGEKEURD BUDGET AJU'!C37","v":"Kies uit lijst Directe Werkingskosten"},{"$f":"'GOEDGEKEURD BUDGET AJU'!E37","v":" "},null,{"$f":"'GOEDGEKEURD BUDGET AJU'!G37","v":0},null,null,{"$f":"'AANVRAAG BUDGET AJU'!R43","v":0},{"$f":"'GOEDGEKEURD BUDGET AJU'!K37","v":0},{"$f":"'GOEDGEKEURD BUDGET AJU'!L37","v":0},{"$f":"'GOEDGEKEURD BUDGET AJU'!M37","v":0},{"$f":"'GOEDGEKEURD BUDGET AJU'!N37","v":0},null,null,null,0,0,{"$f":"'Directe werkingskosten'!I57","v":0},0,{"$f":"'Directe werkingskosten'!J57","v":0},0,0,0,{"$f":"'Directe werkingskosten'!I57","v":0},0,{"$f":"'Directe werkingskosten'!J57","v":0},0]
[null,null,"Kies uit lijst Directe Werkingskosten",null,null,0,null,null,0,0,0,0,0,null,null,{"$f":"'GOEDGEKEURD BUDGET AJU'!C38","v":"Kies uit lijst Directe Werkingskosten"},{"$f":"'GOEDGEKEURD BUDGET AJU'!E38","v":" "},null,{"$f":"'GOEDGEKEURD BUDGET AJU'!G38","v":0},null,null,{"$f":"'AANVRAAG BUDGET AJU'!R44","v":0},{"$f":"'GOEDGEKEURD BUDGET AJU'!K38","v":0},{"$f":"'GOEDGEKEURD BUDGET AJU'!L38","v":0},{"$f":"'GOEDGEKEURD BUDGET AJU'!M38","v":0},{"$f":"'GOEDGEKEURD BUDGET AJU'!N38","v":0},null,null,null,0,0,{"$f":"'Directe werkingskosten'!I70","v":0},0,{"$f":"'Directe werkingskosten'!J70","v":0},0,0,0,{"$f":"'Directe werkingskosten'!I70","v":0},0,{"$f":"'Directe werkingskosten'!J70","v":0},0]
[null,null,"Kies uit lijst Directe Werkingskosten",null,null,0,null,null,0,0,0,0,0,null,null,{"$f":"'GOEDGEKEURD BUDGET AJU'!C39","v":"Kies uit lijst Directe Werkingskosten"},{"$f":"'GOEDGEKEURD BUDGET AJU'!E39","v":" "},null,{"$f":"'GOEDGEKEURD BUDGET AJU'!G39","v":0},null,null,{"$f":"'AANVRAAG BUDGET AJU'!R45","v":0},{"$f":"'GOEDGEKEURD BUDGET AJU'!K39","v":0},{"$f":"'GOEDGEKEURD BUDGET AJU'!L39","v":0},{"$f":"'GOEDGEKEURD BUDGET AJU'!M39","v":0},{"$f":"'GOEDGEKEURD BUDGET AJU'!N39","v":0},null,null,null,0,0,{"$f":"'Directe werkingskosten'!I83","v":0},0,{"$f":"'Directe werkingskosten'!J83","v":0},0,0,0,{"$f":"'Directe werkingskosten'!I83","v":0},0,{"$f":"'Directe werkingskosten'!J83","v":0},0]
[null,null,"Kies uit lijst Directe Werkingskosten",null,null,0,null,null,0,0,0,0,0,null,null,{"$f":"'GOEDGEKEURD BUDGET AJU'!C40","v":"Kies uit lijst Directe Werkingskosten"},{"$f":"'GOEDGEKEURD BUDGET AJU'!E40","v":" "},null,{"$f":"'GOEDGEKEURD BUDGET AJU'!G40","v":0},null,null,{"$f":"'AANVRAAG BUDGET AJU'!R46","v":0},{"$f":"'GOEDGEKEURD BUDGET AJU'!K40","v":0},{"$f":"'GOEDGEKEURD BUDGET AJU'!L40","v":0},{"$f":"'GOEDGEKEURD BUDGET AJU'!M40","v":0},{"$f":"'GOEDGEKEURD BUDGET AJU'!N40","v":0},null,null,null,0,0,{"$f":"'Directe werkingskosten'!I96","v":0},0,{"$f":"'Directe werkingskosten'!J96","v":0},0,0,0,{"$f":"'Directe werkingskosten'!I96","v":0},0,{"$f":"'Directe werkingskosten'!J96","v":0},0]
[null,null,"Kies uit lijst Directe Werkingskosten",null,null,0,null,null,0,0,0,0,0,null,null,{"$f":"'GOEDGEKEURD BUDGET AJU'!C41","v":"Kies uit lijst Directe Werkingskosten"},{"$f":"'GOEDGEKEURD BUDGET AJU'!E41","v":" "},null,{"$f":"'GOEDGEKEURD BUDGET AJU'!G41","v":0},null,null,{"$f":"'AANVRAAG BUDGET AJU'!R47","v":0},{"$f":"'GOEDGEKEURD BUDGET AJU'!K41","v":0},{"$f":"'GOEDGEKEURD BUDGET AJU'!L41","v":0},{"$f":"'GOEDGEKEURD BUDGET AJU'!M41","v":0},{"$f":"'GOEDGEKEURD BUDGET AJU'!N41","v":0},null,null,null,0,0,{"$f":"'Directe werkingskosten'!I109","v":0},0,{"$f":"'Directe werkingskosten'!J109","v":0},0,0,0,{"$f":"'Directe werkingskosten'!I109","v":0},0,{"$f":"'Directe werkingskosten'!J109","v":0},0]
[null,null,"Kies uit lijst Directe Werkingskosten",null,null,0,null,null,0,0,0,0,0,null,null,{"$f":"'GOEDGEKEURD BUDGET AJU'!C42","v":"Kies uit lijst Directe Werkingskosten"},{"$f":"'GOEDGEKEURD BUDGET AJU'!E42","v":" "},null,{"$f":"'GOEDGEKEURD BUDGET AJU'!G42","v":0},null,null,{"$f":"'AANVRAAG BUDGET AJU'!R48","v":0},{"$f":"'GOEDGEKEURD BUDGET AJU'!K42","v":0},{"$f":"'GOEDGEKEURD BUDGET AJU'!L42","v":0},{"$f":"'GOEDGEKEURD BUDGET AJU'!M42","v":0},{"$f":"'GOEDGEKEURD BUDGET AJU'!N42","v":0},null,null,null,0,0,{"$f":"'Directe werkingskosten'!I122","v":0},0,{"$f":"'Directe werkingskosten'!J122","v":0},0,0,0,{"$f":"'Directe werkingskosten'!I122","v":0},0,{"$f":"'Directe werkingskosten'!J122","v":0},0]
[null,null,"Andere: (zelf in te vullen)",null,null,0,null,null,0,0,0,0,0,null,null,{"$f":"'GOEDGEKEURD BUDGET AJU'!C43","v":"Andere: (zelf in te vullen)"},{"$f":"'GOEDGEKEURD BUDGET AJU'!E43","v":" "},null,{"$f":"'GOEDGEKEURD BUDGET AJU'!G43","v":0},null,null,{"$f":"'AANVRAAG BUDGET AJU'!R49","v":0},{"$f":"'GOEDGEKEURD BUDGET AJU'!K43","v":0},{"$f":"'GOEDGEKEURD BUDGET AJU'!L43","v":0},{"$f":"'GOEDGEKEURD BUDGET AJU'!M43","v":0},{"$f":"'GOEDGEKEURD BUDGET AJU'!N43","v":0},null,null,null,0,0,{"$f":"'Directe werkingskosten'!I135","v":0},0,{"$f":"'Directe werkingskosten'!J135","v":0},0,0,0,{"$f":"'Directe werkingskosten'!I135","v":0},0,{"$f":"'Directe werkingskosten'!J135","v":0},0]
[null,null,"Andere: (zelf in te vullen)",null,null,0,null,null,0,0,0,0,0,null,null,{"$f":"'GOEDGEKEURD BUDGET AJU'!C44","v":"Andere: (zelf in te vullen)"},{"$f":"'GOEDGEKEURD BUDGET AJU'!E44","v":" "},null,{"$f":"'GOEDGEKEURD BUDGET AJU'!G44","v":0},null,null,{"$f":"'AANVRAAG BUDGET AJU'!R50","v":0},{"$f":"'GOEDGEKEURD BUDGET AJU'!K44","v":0},{"$f":"'GOEDGEKEURD BUDGET AJU'!L44","v":0},{"$f":"'GOEDGEKEURD BUDGET AJU'!M44","v":0},{"$f":"'GOEDGEKEURD BUDGET AJU'!N44","v":0},null,null,null,0,0,{"$f":"'Directe werkingskosten'!I148","v":0},0,{"$f":"'Directe werkingskosten'!J148","v":0},0,0,0,{"$f":"'Directe werkingskosten'!I148","v":0},0,{"$f":"'Directe werkingskosten'!J148","v":0},0]
[null,null,"Totaal",null,null,{"$f":"SUM(F35:F45)","v":0},null,null,{"$f":"SUM(I35:I45)","v":0},{"$f":"SUM(J35:J45)","v":0},{"$f":"IF(I46=0,0,J46/I46)","v":0},{"$f":"SUM(L35:L45)","v":0},0,null,null,"Totaal",null,null,{"$f":"SUM(S35:S45)","v":0},null,null,{"$f":"SUM(V35:V45)","v":0},{"$f":"SUM(W35:W45)","v":0},{"$f":"IF(V46=0,0,W46/V46)","v":0},{"$f":"SUM(Y35:Y45)","v":0},{"$f":"IF(V46=0,0,Y46/V46)","v":0},null,null,null,{"$f":"SUM(AD35:AD45)","v":0},0,{"$f":"SUM(AF35:AF45)","v":0},{"$f":"IF(AD46=0,0,AF46/AD46)","v":0},{"$f":"SUM(AH35:AH45)","v":0},{"$f":"IF(AD46=0,0,AH46/AD46)","v":0},{"$f":"SUM(AJ35:AJ45)","v":0},{"$f":"IF(I46=0,0,AJ46/I46)","v":0},{"$f":"SUM(AL35:AL45)","v":0},{"$f":"IF(AJ46=0,0,AL46/AJ46)","v":0},{"$f":"SUM(AN35:AN45)","v":0},{"$f":"IF(AJ46=0,0,AN46/AJ46)","v":0}]
[null,null,"Indirecte werkingskosten",null,null,null,null,null,null,null,null,null,null,null,null,"Indirecte werkingskosten"]
[null,null,"Kies uit lijst Indirecte Werkingskosten",null,null,0,null,0,{"$f":"H48*G48*E48","v":0},0,{"$f":"IF(I48=0,0,J48/I48)","v":0},{"$f":"I48-J48","v":0},{"$f":"IF(I48=0,0,L48/I48)","v":0},null,null,{"$f":"'GOEDGEKEURD BUDGET AJU'!C47","v":"Kies uit lijst Indirecte Werkingskosten"},null,null,{"$f":"'GOEDGEKEURD BUDGET AJU'!G47","v":0},null,{"$f":"'GOEDGEKEURD BUDGET AJU'!I47","v":0},{"$f":"'AANVRAAG BUDGET AJU'!R54","v":0},{"$f":"'GOEDGEKEURD BUDGET AJU'!K47","v":0},{"$f":"'GOEDGEKEURD BUDGET AJU'!L47","v":0},{"$f":"'GOEDGEKEURD BUDGET AJU'!M47","v":0},{"$f":"'GOEDGEKEURD BUDGET AJU'!N47","v":0},null,null,null,{"$f":"AF48+AH48","v":0},{"$f":"IF(I48=0,0,AD48/I48)","v":0},{"$f":"'Indirecte werkingskosten'!I18","v":0},{"$f":"IF(AD48=0,0,AF48/AD48)","v":0},{"$f":"'Indirecte werkingskosten'!K18","v":0},{"$f":"IF(AD48=0,0,AH48/AD48)","v":0},{"$f":"AL48+AN48","v":0},{"$f":"IF(V48=0,0,AJ48/V48)","v":0},{"$f":"'Indirecte werkingskosten'!I18","v":0},{"$f":"IF(AJ48=0,0,AL48/AJ48)","v":0},{"$f":"'Indirecte werkingskosten'!K18","v":0},{"$f":"IF(AJ48=0,0,AN48/AJ48)","v":0}]
[null,null,"Kies uit lijst Indirecte Werkingskosten",null,null,0,null,0,{"$f":"H49*G49*E49","v":0},0,{"$f":"IF(I49=0,0,J49/I49)","v":0},{"$f":"I49-J49","v":0},{"$f":"IF(I49=0,0,L49/I49)","v":0},null,null,{"$f":"'GOEDGEKEURD BUDGET AJU'!C48","v":"Kies uit lijst Indirecte Werkingskosten"},null,null,{"$f":"'GOEDGEKEURD BUDGET AJU'!G48","v":0},null,{"$f":"'GOEDGEKEURD BUDGET AJU'!I48","v":0},{"$f":"'AANVRAAG BUDGET AJU'!R55","v":0},{"$f":"'GOEDGEKEURD BUDGET AJU'!K48","v":0},{"$f":"'GOEDGEKEURD BUDGET AJU'!L48","v":0},{"$f":"'GOEDGEKEURD BUDGET AJU'!M48","v":0},{"$f":"'GOEDGEKEURD BUDGET AJU'!N48","v":0},null,null,null,{"$f":"AF49+AH49","v":0},0,{"$f":"'Indirecte werkingskosten'!I31","v":0},0,{"$f":"'Indirecte werkingskosten'!K31","v":0},0,{"$f":"AL49+AN49","v":0},{"$f":"IF(V49=0,0,AJ49/V49)","v":0},{"$f":"'Indirecte werkingskosten'!I31","v":0},0,{"$f":"'Indirecte werkingskosten'!K31","v":0},0]
[null,null,"Kies uit lijst Indirecte Werkingskosten",null,null,0,null,0,0,0,0,0,0,null,null,{"$f":"'GOEDGEKEURD BUDGET AJU'!C49","v":"Kies uit lijst Indirecte Werkingskosten"},null,null,{"$f":"'GOEDGEKEURD BUDGET AJU'!G49","v":0},null,{"$f":"'GOEDGEKEURD BUDGET AJU'!I49","v":0},{"$f":"'AANVRAAG BUDGET AJU'!R56","v":0},{"$f":"'GOEDGEKEURD BUDGET AJU'!K49","v":0},{"$f":"'GOEDGEKEURD BUDGET AJU'!L49","v":0},{"$f":"'GOEDGEKEURD BUDGET AJU'!M49","v":0},{"$f":"'GOEDGEKEURD BUDGET AJU'!N49","v":0},null,null,null,0,0,{"$f":"'Indirecte werkingskosten'!I44","v":0},0,{"$f":"'Indirecte werkingskosten'!K44","v":0},0,0,0,{"$f":"'Indirecte werkingskosten'!I44","v":0},0,{"$f":"'Indirecte werkingskosten'!K44","v":0},0]
[null,null,"Kies uit lijst Indirecte Werkingskosten",null,null,0,null,0,0,0,0,0,0,null,null,{"$f":"'GOEDGEKEURD BUDGET AJU'!C50","v":"Kies uit lijst Indirecte Werkingskosten"},null,null,{"$f":"'GOEDGEKEURD BUDGET AJU'!G50","v":0},null,{"$f":"'GOEDGEKEURD BUDGET AJU'!I50","v":0},{"$f":"'AANVRAAG BUDGET AJU'!R57","v":0},{"$f":"'GOEDGEKEURD BUDGET AJU'!K50","v":0},{"$f":"'GOEDGEKEURD BUDGET AJU'!L50","v":0},{"$f":"'GOEDGEKEURD BUDGET AJU'!M50","v":0},{"$f":"'GOEDGEKEURD BUDGET AJU'!N50","v":0},null,null,null,0,0,{"$f":"'Indirecte werkingskosten'!I57","v":0},0,{"$f":"'Indirecte werkingskosten'!K57","v":0},0,0,0,{"$f":"'Indirecte werkingskosten'!I57","v":0},0,{"$f":"'Indirecte werkingskosten'!K57","v":0},0]
[null,null,"Kies uit lijst Indirecte Werkingskosten",null,null,0,null,0,0,0,0,0,0,null,null,{"$f":"'GOEDGEKEURD BUDGET AJU'!C51","v":"Kies uit lijst Indirecte Werkingskosten"},null,null,{"$f":"'GOEDGEKEURD BUDGET AJU'!G51","v":0},null,{"$f":"'GOEDGEKEURD BUDGET AJU'!I51","v":0},{"$f":"'AANVRAAG BUDGET AJU'!R58","v":0},{"$f":"'GOEDGEKEURD BUDGET AJU'!K51","v":0},{"$f":"'GOEDGEKEURD BUDGET AJU'!L51","v":0},{"$f":"'GOEDGEKEURD BUDGET AJU'!M51","v":0},{"$f":"'GOEDGEKEURD BUDGET AJU'!N51","v":0},null,null,null,0,0,{"$f":"'Indirecte werkingskosten'!I70","v":0},0,{"$f":"'Indirecte werkingskosten'!K70","v":0},0,0,0,{"$f":"'Indirecte werkingskosten'!I70","v":0},0,{"$f":"'Indirecte werkingskosten'!K70","v":0},0]
[null,null,"Kies uit lijst Indirecte Werkingskosten",null,null,0,null,0,0,0,0,0,0,null,null,{"$f":"'GOEDGEKEURD BUDGET AJU'!C52","v":"Kies uit lijst Indirecte Werkingskosten"},null,null,{"$f":"'GOEDGEKEURD BUDGET AJU'!G52","v":0},null,{"$f":"'GOEDGEKEURD BUDGET AJU'!I52","v":0},{"$f":"'AANVRAAG BUDGET AJU'!R59","v":0},{"$f":"'GOEDGEKEURD BUDGET AJU'!K52","v":0},{"$f":"'GOEDGEKEURD BUDGET AJU'!L52","v":0},{"$f":"'GOEDGEKEURD BUDGET AJU'!M52","v":0},{"$f":"'GOEDGEKEURD BUDGET AJU'!N52","v":0},null,null,null,0,0,{"$f":"'Indirecte werkingskosten'!I83","v":0},0,{"$f":"'Indirecte werkingskosten'!K83","v":0},0,0,0,{"$f":"'Indirecte werkingskosten'!I83","v":0},0,{"$f":"'Indirecte werkingskosten'!K83","v":0},0]
[null,null,"Kies uit lijst Indirecte Werkingskosten",null,null,0,null,0,0,0,0,0,0,null,null,{"$f":"'GOEDGEKEURD BUDGET AJU'!C53","v":"Kies uit lijst Indirecte Werkingskosten"},null,null,{"$f":"'GOEDGEKEURD BUDGET AJU'!G53","v":0},null,{"$f":"'GOEDGEKEURD BUDGET AJU'!I53","v":0},{"$f":"'AANVRAAG BUDGET AJU'!R60","v":0},{"$f":"'GOEDGEKEURD BUDGET AJU'!K53","v":0},{"$f":"'GOEDGEKEURD BUDGET AJU'!L53","v":0},{"$f":"'GOEDGEKEURD BUDGET AJU'!M53","v":0},{"$f":"'GOEDGEKEURD BUDGET AJU'!N53","v":0},null,null,null,0,0,{"$f":"'Indirecte werkingskosten'!I96","v":0},0,{"$f":"'Indirecte werkingskosten'!K96","v":0},0,0,0,{"$f":"'Indirecte werkingskosten'!I96","v":0},0,{"$f":"'Indirecte werkingskosten'!K96","v":0},0]
[null,null,"Kies uit lijst Indirecte Werkingskosten",null,null,0,null,0,0,0,0,0,0,null,null,{"$f":"'GOEDGEKEURD BUDGET AJU'!C54","v":"Kies uit lijst Indirecte Werkingskosten"},null,null,{"$f":"'GOEDGEKEURD BUDGET AJU'!G54","v":0},null,{"$f":"'GOEDGEKEURD BUDGET AJU'!I54","v":0},{"$f":"'AANVRAAG BUDGET AJU'!R61","v":0},{"$f":"'GOEDGEKEURD BUDGET AJU'!K54","v":0},{"$f":"'GOEDGEKEURD BUDGET AJU'!L54","v":0},{"$f":"'GOEDGEKEURD BUDGET AJU'!M54","v":0},{"$f":"'GOEDGEKEURD BUDGET AJU'!N54","v":0},null,null,null,0,0,{"$f":"'Indirecte werkingskosten'!I109","v":0},0,{"$f":"'Indirecte werkingskosten'!K109","v":0},0,0,0,{"$f":"'Indirecte werkingskosten'!I109","v":0},0,{"$f":"'Indirecte werkingskosten'!K109","v":0},0]
[null,null,"Kies uit lijst Indirecte Werkingskosten",null,null,0,null,0,0,0,0,0,0,null,null,{"$f":"'GOEDGEKEURD BUDGET AJU'!C55","v":"Kies uit lijst Indirecte Werkingskosten"},null,null,{"$f":"'GOEDGEKEURD BUDGET AJU'!G55","v":0},null,{"$f":"'GOEDGEKEURD BUDGET AJU'!I55","v":0},{"$f":"'AANVRAAG BUDGET AJU'!R62","v":0},{"$f":"'GOEDGEKEURD BUDGET AJU'!K55","v":0},{"$f":"'GOEDGEKEURD BUDGET AJU'!L55","v":0},{"$f":"'GOEDGEKEURD BUDGET AJU'!M55","v":0},{"$f":"'GOEDGEKEURD BUDGET AJU'!N55","v":0},null,null,null,0,0,{"$f":"'Indirecte werkingskosten'!I122","v":0},0,{"$f":"'Indirecte werkingskosten'!K122","v":0},0,0,0,{"$f":"'Indirecte werkingskosten'!I122","v":0},0,{"$f":"'Indirecte werkingskosten'!K122","v":0},0]
[null,null,"Andere: (zelf in te vullen)",null,null,0,null,0,0,0,0,0,0,null,null,{"$f":"'GOEDGEKEURD BUDGET AJU'!C57","v":"Andere: (zelf in te vullen)"},null,null,{"$f":"'GOEDGEKEURD BUDGET AJU'!G57","v":0},null,{"$f":"'GOEDGEKEURD BUDGET AJU'!I57","v":0},{"$f":"'AANVRAAG BUDGET AJU'!R63","v":0},{"$f":"'GOEDGEKEURD BUDGET AJU'!K57","v":0},{"$f":"'GOEDGEKEURD BUDGET AJU'!L57","v":0},{"$f":"'GOEDGEKEURD BUDGET AJU'!M57","v":0},{"$f":"'GOEDGEKEURD BUDGET AJU'!N57","v":0},null,null,null,0,0,{"$f":"'Indirecte werkingskosten'!I148","v":0},0,{"$f":"'Indirecte werkingskosten'!K148","v":0},0,0,0,{"$f":"'Indirecte werkingskosten'!I148","v":0},0,{"$f":"'Indirecte werkingskosten'!K148","v":0},0]
[null,null,"Andere: (zelf in te vullen)",null,null,0,null,0,0,0,0,0,0,null,null,{"$f":"'GOEDGEKEURD BUDGET AJU'!C58","v":"Andere: (zelf in te vullen)"},null,null,{"$f":"'GOEDGEKEURD BUDGET AJU'!G58","v":0},null,{"$f":"'GOEDGEKEURD BUDGET AJU'!I58","v":0},{"$f":"'AANVRAAG BUDGET AJU'!R64","v":0},{"$f":"'GOEDGEKEURD BUDGET AJU'!K58","v":0},{"$f":"'GOEDGEKEURD BUDGET AJU'!L58","v":0},{"$f":"'GOEDGEKEURD BUDGET AJU'!M58","v":0},{"$f":"'GOEDGEKEURD BUDGET AJU'!N58","v":0},null,null,null,0,0,{"$f":"'Indirecte werkingskosten'!I161","v":0},0,{"$f":"'Indirecte werkingskosten'!K161","v":0},0,0,{"$f":"IF(V58=0,0,AJ58/V58)","v":0},{"$f":"'Indirecte werkingskosten'!I161","v":0},0,{"$f":"'Indirecte werkingskosten'!K161","v":0},0]
[null,null,"Totaal",null,null,{"$f":"SUM(F48:F58)","v":0},null,null,{"$f":"SUM(I48:I58)","v":0},{"$f":"SUM(J48:J58)","v":0},{"$f":"IF(I59=0,0,J59/I59)","v":0},{"$f":"SUM(L48:L58)","v":0},{"$f":"IF(I59=0,0,L59/I59)","v":0},null,null,"Totaal",null,null,{"$f":"SUM(S48:S58)","v":0},null,null,{"$f":"SUM(V48:V58)","v":0},{"$f":"SUM(W48:W58)","v":0},{"$f":"IF(V59=0,0,W59/V59)","v":0},{"$f":"SUM(Y48:Y58)","v":0},{"$f":"IF(V59=0,0,Y59/V59)","v":0},null,null,null,{"$f":"SUM(AD48:AD58)","v":0},0,{"$f":"SUM(AF48:AF58)","v":0},{"$f":"IF(AD59=0,0,AF59/AD59)","v":0},{"$f":"SUM(AH48:AH58)","v":0},{"$f":"IF(AD59=0,0,AH59/AD59)","v":0},{"$f":"SUM(AJ48:AJ58)","v":0},{"$f":"IF(I59=0,0,AJ59/I59)","v":0},{"$f":"SUM(AL48:AL58)","v":0},{"$f":"IF(AJ59=0,0,AL59/AJ59)","v":0},{"$f":"SUM(AN48:AN58)","v":0},{"$f":"IF(AJ59=0,0,AN59/AJ59)","v":0}]
[null,null,null,null,"MAX TOEGELATEN INDIRECTE KOSTEN:",null,null,null,null,{"$f":"(J24+J27+J33+J46)/100*7","v":0},null,null,null,null,null,null,null,"MAX TOEGELATEN INDIRECTE KOSTEN:",null,null,null,null,{"$f":"(W24+W27+W33+W46)/100*7","v":0}]
[null,null,"TOTAAL",null,null,null,null,null,{"$f":"I59+I46+I33+I27+I24","v":0},{"$f":"J59+J46+J33+J27+J24","v":0},0,{"$f":"L59+L46+L33+L27+L24","v":0},0,null,null,"TOTAAL",null,null,null,null,null,{"$f":"V59+V46+V33+V27+V24","v":0},{"$f":"W59+W46+W33+W27+W24","v":0},{"$f":"IF(V61=0,0,W61/V61)","v":0},{"$f":"Y59+Y46+Y33+Y27+Y24","v":0},{"$f":"IF(V61=0,0,Y61/V61)","v":0},null,null,null,{"$f":"AD24+AD27+AD33+AD46+AD59","v":0},{"$f":"IF(I61=0,0,AD61/I61)","v":0},{"$f":"AF24+AF27+AF33+AF46+AF59","v":0},{"$f":"IF(AD61=0,0,AF61/AD61)","v":0},{"$f":"AH24+AH27+AH33+AH46+AH59","v":0},{"$f":"IF(AD61=0,0,AH61/AD61)","v":0},{"$f":"AJ24+AJ27+AJ33+AJ46+AJ59","v":0},{"$f":"IF(I61=0,0,AJ61/I61)","v":0},{"$f":"AL24+AL27+AL33+AL46+AL59","v":0},{"$f":"IF(AJ61=0,0,AL61/AJ61)","v":0},{"$f":"AN24+AN27+AN33+AN46+AN59","v":0},{"$f":"IF(AJ61=0,0,AN61/AJ61)","v":0}]
[null,null,"* Budget INI= initieel budget dat werd goedgekeurd door Fedasil",null,null,null,null,null,null,null,null,null,null,null,null,"* Budget INI= initieel budget dat werd goedgekeurd door Fedasil"]
[null,null,"**Budget AJU= aangepast budget ",null,null,null,null,null,null,null,null,null,null,null,null,"**Budget AJU= aangepast budget "]
[]
[]
[]
[null,null,null,"BUDGET INI*",null,null,null,null,null,null,null,null,null,null,null,null,"BUDGET AJU**",null,null,null,null,null,null,null,null,null,null,null,null,"GEREALISEERD - 6 MAANDEN",null,null,null,null,null,"GEREALISEERD NA CONTROLE - 12 MAANDEN"]
[null,null,"Financiering",null,null,"Zekerheid",null,null,"Totaal bedrag project","Goedgekeurd Fedasil (project of activiteit)","% Fedasil","Andere financieringsbronnen","% andere bronnen",null,null,"Financiering",null,null,"Zekerheid",null,null,"Totaal bedrag project","Goedgekeurd Fedasil (project of activiteit)","% Fedasil","Andere financieringsbronnen",null,null,null,null,"Totaal bedrag gerealiseerd",null,"Fedasil reële uitgaven","Fedasil gereali-seerd % ","Andere reële financierings-bronnen","% andere bronnen","Totaal bedrag gerealiseerd",null,"Fedasil reële uitgaven","Fedasil gereali-seerd % ","Andere reële financierings-bronnen","% andere bronnen"]
[null,null,{"$f":"IF('GOEDGEKEURD BUDGET AJU'!C69='GOEDGEKEURD INI BUDGET'!C72,'GOEDGEKEURD BUDGET AJU'!C69,'GOEDGEKEURD INI BUDGET'!C72)","v":"Fedasil"},null,null,{"$f":"IF('GOEDGEKEURD BUDGET AJU'!G69='GOEDGEKEURD INI BUDGET'!G72,'GOEDGEKEURD BUDGET AJU'!G69,'GOEDGEKEURD INI BUDGET'!G72)","v":"Aangevraagd"},null,null,{"$f":"IF('GOEDGEKEURD BUDGET AJU'!J69='GOEDGEKEURD INI BUDGET'!J72,'GOEDGEKEURD BUDGET AJU'!J69,'GOEDGEKEURD INI BUDGET'!J72)","v":0},{"$f":"IF('GOEDGEKEURD BUDGET AJU'!K69='GOEDGEKEURD INI BUDGET'!K72,'GOEDGEKEURD BUDGET AJU'!K69,'GOEDGEKEURD INI BUDGET'!K72)","v":0},{"$f":"IF($I$61=0,0,J69/$I$61)","v":0},null,null,null,null,{"$f":"'GOEDGEKEURD BUDGET AJU'!C69","v":"Fedasil"},null,null,{"$f":"'GOEDGEKEURD BUDGET AJU'!G69","v":"Aangevraagd"},null,null,{"$f":"'GOEDGEKEURD BUDGET AJU'!J69","v":0},{"$f":"'GOEDGEKEURD BUDGET AJU'!K69","v":0},{"$f":"'GOEDGEKEURD BUDGET AJU'!L69","v":0},null,null,null,null,null,{"$f":"AD61","v":0},null,{"$f":"AF61","v":0},{"$f":"IF($I$61=0,0,AF69/$I$61)","v":0},null,null,{"$f":"AJ61","v":0},null,{"$f":"AL61","v":0},{"$f":"IF($I$61=0,0,AL69/$I$61)","v":0}]
[null,null,{"$f":"IF('GOEDGEKEURD BUDGET AJU'!C70='GOEDGEKEURD INI BUDGET'!C73,'GOEDGEKEURD BUDGET AJU'!C70,'GOEDGEKEURD INI BUDGET'!C73)","v":"Eigen middelen"},null,null,{"$f":"IF('GOEDGEKEURD BUDGET AJU'!G70='GOEDGEKEURD INI BUDGET'!G73,'GOEDGEKEURD BUDGET AJU'!G70,'GOEDGEKEURD INI BUDGET'!G73)","v":"(in te vullen)"},null,null,{"$f":"IF('GOEDGEKEURD BUDGET AJU'!J70='GOEDGEKEURD INI BUDGET'!J73,'GOEDGEKEURD BUDGET AJU'!J70,'GOEDGEKEURD INI BUDGET'!J73)","v":0},null,null,{"$f":"IF('GOEDGEKEURD BUDGET AJU'!M70='GOEDGEKEURD INI BUDGET'!M73,'GOEDGEKEURD BUDGET AJU'!M70,'GOEDGEKEURD INI BUDGET'!M73)","v":0},{"$f":"IF($I$61=0,0,L70/$I$61)","v":0},null,null,{"$f":"'GOEDGEKEURD BUDGET AJU'!C70","v":"Kies uit lijst Financiering"},null,null,{"$f":"'GOEDGEKEURD BUDGET AJU'!G70","v":"(in te vullen)"},null,null,{"$f":"'GOEDGEKEURD BUDGET AJU'!J70","v":0},null,null,{"$f":"'GOEDGEKEURD BUDGET AJU'!M70","v":0},{"$f":"'GOEDGEKEURD BUDGET AJU'!N70","v":0},null,null,null,{"$f":"AH70","v":0},null,null,null,{"$f":"AH61","v":0},{"$f":"AI61","v":0},{"$f":"AN70","v":0},null,null,null,{"$f":"AN61","v":0},{"$f":"IF($I$61=0,0,AN70/$I$61)","v":0}]
[null,null,{"$f":"IF('GOEDGEKEURD BUDGET AJU'!C71='GOEDGEKEURD INI BUDGET'!C74,'GOEDGEKEURD BUDGET AJU'!C71,'GOEDGEKEURD INI BUDGET'!C74)","v":"Andere: (zelf in te vullen)"},null,null,{"$f":"IF('GOEDGEKEURD BUDGET AJU'!G71='GOEDGEKEURD INI BUDGET'!G74,'GOEDGEKEURD BUDGET AJU'!G71,'GOEDGEKEURD INI BUDGET'!G74)","v":"(in te vullen)"},null,null,{"$f":"IF('GOEDGEKEURD BUDGET AJU'!J71='GOEDGEKEURD INI BUDGET'!J74,'GOEDGEKEURD BUDGET AJU'!J71,'GOEDGEKEURD INI BUDGET'!J74)","v":0},null,null,{"$f":"IF('GOEDGEKEURD BUDGET AJU'!M71='GOEDGEKEURD INI BUDGET'!M74,'GOEDGEKEURD BUDGET AJU'!M71,'GOEDGEKEURD INI BUDGET'!M74)","v":0},{"$f":"IF($I$61=0,0,L71/$I$61)","v":0},null,null,{"$f":"'GOEDGEKEURD BUDGET AJU'!C71","v":"Kies uit lijst Financiering"},null,null,{"$f":"'GOEDGEKEURD BUDGET AJU'!G71","v":"(in te vullen)"},null,null,{"$f":"'GOEDGEKEURD BUDGET AJU'!J71","v":0},null,null,{"$f":"'GOEDGEKEURD BUDGET AJU'!M71","v":0},{"$f":"'GOEDGEKEURD BUDGET AJU'!N71","v":0},null,null,null,{"$f":"AH71","v":0},null,null,null,0,{"$f":"IF($I$61=0,0,AH71/$I$61)","v":0},{"$f":"AN71","v":0},null,null,null,0,0]
[null,null,{"$f":"IF('GOEDGEKEURD BUDGET AJU'!C72='GOEDGEKEURD INI BUDGET'!C75,'GOEDGEKEURD BUDGET AJU'!C72,'GOEDGEKEURD INI BUDGET'!C75)","v":"Andere: (zelf in te vullen)"},null,null,{"$f":"IF('GOEDGEKEURD BUDGET AJU'!G72='GOEDGEKEURD INI BUDGET'!G75,'GOEDGEKEURD BUDGET AJU'!G72,'GOEDGEKEURD INI BUDGET'!G75)","v":"(in te vullen)"},null,null,{"$f":"IF('GOEDGEKEURD BUDGET AJU'!J72='GOEDGEKEURD INI BUDGET'!J75,'GOEDGEKEURD BUDGET AJU'!J72,'GOEDGEKEURD INI BUDGET'!J75)","v":0},null,null,{"$f":"IF('GOEDGEKEURD BUDGET AJU'!M72='GOEDGEKEURD INI BUDGET'!M75,'GOEDGEKEURD BUDGET AJU'!M72,'GOEDGEKEURD INI BUDGET'!M75)","v":0},{"$f":"IF($I$61=0,0,L72/$I$61)","v":0},null,null,{"$f":"'GOEDGEKEURD BUDGET AJU'!C72","v":"Kies uit lijst Financiering"},null,null,{"$f":"'GOEDGEKEURD BUDGET AJU'!G72","v":"(in te vullen)"},null,null,{"$f":"'GOEDGEKEURD BUDGET AJU'!J72","v":0},null,null,{"$f":"'GOEDGEKEURD BUDGET AJU'!M72","v":0},{"$f":"'GOEDGEKEURD BUDGET AJU'!N72","v":0},null,null,null,{"$f":"AH72","v":0},null,null,null,0,{"$f":"IF($I$61=0,0,AH72/$I$61)","v":0},{"$f":"AN72","v":0},null,null,null,0,0]
[null,null,{"$f":"IF('GOEDGEKEURD BUDGET AJU'!C73='GOEDGEKEURD INI BUDGET'!C76,'GOEDGEKEURD BUDGET AJU'!C73,'GOEDGEKEURD INI BUDGET'!C76)","v":"Andere: (zelf in te vullen)"},null,null,{"$f":"IF('GOEDGEKEURD BUDGET AJU'!G73='GOEDGEKEURD INI BUDGET'!G76,'GOEDGEKEURD BUDGET AJU'!G73,'GOEDGEKEURD INI BUDGET'!G76)","v":"(in te vullen)"},null,null,{"$f":"IF('GOEDGEKEURD BUDGET AJU'!J73='GOEDGEKEURD INI BUDGET'!J76,'GOEDGEKEURD BUDGET AJU'!J73,'GOEDGEKEURD INI BUDGET'!J76)","v":0},null,null,{"$f":"IF('GOEDGEKEURD BUDGET AJU'!M73='GOEDGEKEURD INI BUDGET'!M76,'GOEDGEKEURD BUDGET AJU'!M73,'GOEDGEKEURD INI BUDGET'!M76)","v":0},0,null,null,{"$f":"'GOEDGEKEURD BUDGET AJU'!C73","v":"Kies uit lijst Financiering"},null,null,{"$f":"'GOEDGEKEURD BUDGET AJU'!G73","v":"(in te vullen)"},null,null,{"$f":"'GOEDGEKEURD BUDGET AJU'!J73","v":0},null,null,{"$f":"'GOEDGEKEURD BUDGET AJU'!M73","v":0},{"$f":"'GOEDGEKEURD BUDGET AJU'!N73","v":0},null,null,null,{"$f":"AH73","v":0},null,null,null,0,{"$f":"IF($I$61=0,0,AH73/$I$61)","v":0},{"$f":"AN73","v":0},null,null,null,0,0]
[null,null,{"$f":"IF('GOEDGEKEURD BUDGET AJU'!C74='GOEDGEKEURD INI BUDGET'!C77,'GOEDGEKEURD BUDGET AJU'!C74,'GOEDGEKEURD INI BUDGET'!C77)","v":"Andere: (zelf in te vullen)"},null,null,{"$f":"IF('GOEDGEKEURD BUDGET AJU'!G74='GOEDGEKEURD INI BUDGET'!G77,'GOEDGEKEURD BUDGET AJU'!G74,'GOEDGEKEURD INI BUDGET'!G77)","v":"(in te vullen)"},null,null,{"$f":"IF('GOEDGEKEURD BUDGET AJU'!J74='GOEDGEKEURD INI BUDGET'!J77,'GOEDGEKEURD BUDGET AJU'!J74,'GOEDGEKEURD INI BUDGET'!J77)","v":0},null,null,{"$f":"IF('GOEDGEKEURD BUDGET AJU'!M74='GOEDGEKEURD INI BUDGET'!M77,'GOEDGEKEURD BUDGET AJU'!M74,'GOEDGEKEURD INI BUDGET'!M77)","v":0},0,null,null,{"$f":"'GOEDGEKEURD BUDGET AJU'!C74","v":"Andere: (zelf in te vullen)"},null,null,{"$f":"'GOEDGEKEURD BUDGET AJU'!G74","v":"(in te vullen)"},null,null,{"$f":"'GOEDGEKEURD BUDGET AJU'!J74","v":0},null,null,{"$f":"'GOEDGEKEURD BUDGET AJU'!M74","v":0},{"$f":"'GOEDGEKEURD BUDGET AJU'!N74","v":0},null,null,null,{"$f":"AH74","v":0},null,null,null,0,{"$f":"IF($I$61=0,0,AH74/$I$61)","v":0},{"$f":"AN74","v":0},null,null,null,0,0]
[null,null,"TOTAAL",null,null,null,null,null,{"$f":"SUM(I69:I74)","v":0},{"$f":"SUM(J69:J74)","v":0},{"$f":"IF($I$61=0,0,J75/$I$61)","v":0},{"$f":"SUM(L70:L74)","v":0},{"$f":"IF($I$61=0,0,L75/$I$61)","v":0},null,null,"TOTAAL",null,null,null,null,null,{"$f":"SUM(V69:V74)","v":0},{"$f":"SUM(W69:W74)","v":0},{"$f":"IF($I$61=0,0,W75/$I$61)","v":0},{"$f":"SUM(Y70:Y74)","v":0},{"$f":"IF($I$61=0,0,Y75/$I$61)","v":0},null,null,null,{"$f":"SUM(AE69:AE74)","v":0},null,{"$f":"SUM(AF69:AF74)","v":0},{"$f":"IF($I$61=0,0,AF75/$I$61)","v":0},{"$f":"SUM(AH70:AH74)","v":0},{"$f":"IF($I$61=0,0,AH75/$I$61)","v":0},{"$f":"SUM(AK69:AK74)","v":0},null,{"$f":"SUM(AL69:AL74)","v":0},{"$f":"IF($I$61=0,0,AL75/$I$61)","v":0},{"$f":"SUM(AN70:AN74)","v":0},{"$f":"IF($I$61=0,0,AN75/$I$61)","v":0}]
[]
[null,null,null,null,"VERSCHIL TUSSEN BUDGET EN FINANCIERING",null,null,null,{"$f":"I61-I75","v":0},null,null,{"$f":"L61-L75","v":0},null,null,null,null,null,"VERSCHIL TUSSEN BUDGET EN FINANCIERING",null,null,null,{"$f":"V61-V75","v":0},null,null,{"$f":"Y61-Y75","v":0}]

{"sheet":"FEEDBACK Tussentijds Verslag","index":20,"n_rows":27,"n_cols":1,"rows_kept":27,"cut":false,"hidden":true,"merged":[]}
[]
[]
["FEEDBACK TUSSENTIJDS VERSLAG"]
[{"$f":"CONCATENATE('FEEDBACK Tussentijds Verslag'!D11,\" - \",'Bijkomende vragen Fin Verslag'!A3)","v":" - 2021/XX"}]
["ALGEMENE VASTSTELLING"]
[]
[]
[]
[]
[]
[]
[]
[]
[]
[]
["VOORSTELLEN TOT VERBETERINGEN"]
[]
[]
[]
[]
[]
[]
[]
[]
[]
[]
["ANTWOORD VZW & REACTIE FEDASIL"]

{"sheet":"FEEDBACK Eindverslag","index":21,"n_rows":79,"n_cols":8,"rows_kept":79,"cut":false,"hidden":true,"merged":[[78,0,78,6],[78,7,78,8],[77,0,77,3],[77,4,77,8],[48,0,48,6],[48,7,48,8],[56,0,56,6],[56,7,56,8],[62,0,62,6],[62,7,62,8],[70,0,70,6],[70,7,70,8],[69,0,69,6],[69,7,69,8],[55,0,55,6],[55,7,55,8],[61,0,61,6],[61,7,61,8],[1,0,1,8],[3,0,3,8],[39,0,39,8],[47,7,47,8],[47,0,47,6],[2,0,2,8]]}
[]
["FEEDBACK EINDVERSLAG"]
[{"$f":"CONCATENATE('FEEDBACK Tussentijds Verslag'!D11,\" - \",'Bijkomende vragen Fin Verslag'!A3)","v":" - 2021/XX"}]
["ALGEMENE VASTSTELLING"]
[]
["PERSONEELSKOSTEN"]
[]
[]
[]
[]
[]
[]
["HUUR"]
[]
[]
[]
[]
[]
[]
["INVESTERINGEN"]
[]
[]
[]
[]
[]
["DIRECTE WERKINGSKOSTEN"]
[]
[]
[]
[]
[]
[]
["INDIRECTE WERKINGSKOSTEN"]
[]
[]
[]
[]
[]
[]
["ANTWOORD VZW & REACTIE FEDASIL"]
[]
["PERSONEELSKOSTEN"]
[]
[]
[]
[]
[]
["Subsidiabele kost",null,null,null,null,null,null,"Niet-Subsidiabele Kost"]
[{"$f":"Personeelskosten!T133","v":0},null,null,null,null,null,null,{"$f":"Personeelskosten!U133","v":0}]
["HUUR"]
[]
[]
[]
[]
[]
["Subsidiabele kost",null,null,null,null,null,null,"Niet-Subsidiabele Kost"]
[{"$f":"Huur!M19","v":0},null,null,null,null,null,null,{"$f":"Huur!N19","v":0}]
["INVESTERINGEN"]
[]
[]
[]
["Subsidiabele kost",null,null,null,null,null,null,"Niet-Subsidiabele Kost"]
[{"$f":"Investeringen!O10","v":0},null,null,null,null,null,null,{"$f":"Investeringen!P10","v":0}]
["DIRECTE WERKINGSKOSTEN"]
[]
[]
[]
[]
[]
["Subsidiabele kost",null,null,null,null,null,null,"Niet-Subsidiabele Kost"]
[{"$f":"'Directe werkingskosten'!R149","v":0},null,null,null,null,null,null,{"$f":"'Directe werkingskosten'!S149","v":0}]
["INDIRECTE WERKINGSKOSTEN"]
[]
[]
[]
[]
[]
["Subsidiabele kost",null,null,null,"Niet-Subsidiabele Kost"]
[{"$f":"'Indirecte werkingskosten'!N162","v":0},null,null,null,null,null,null,{"$f":"'Indirecte werkingskosten'!O162","v":0}]

{"sheet":"FINAAL CONTROLE VERSLAG","index":22,"n_rows":185,"n_cols":9,"rows_kept":185,"cut":false,"hidden":true,"merged":[[180,0,181,9],[5,0,5,6],[6,0,6,9],[137,0,137,9],[51,7,51,8],[71,0,71,9],[72,0,72,9],[73,0,73,9],[74,0,74,9],[75,0,75,9],[77,0,77,9],[78,0,78,9],[64,0,64,9],[76,0,76,9],[70,0,70,9],[51,3,51,4],[51,5,51,6],[133,0,133,9],[99,0,99,9],[121,0,121,9],[122,0,122,9],[123,0,123,9],[124,0,124,9],[125,0,125,9],[126,0,126,9],[127,0,127,9],[128,0,128,9],[36,3,36,4],[1,3,1,5],[12,3,12,5],[13,3,13,5],[15,3,15,5],[3,3,3,4],[46,7,46,8],[47,7,47,8],[37,3,37,4],[38,3,38,4],[39,3,39,4],[40,3,40,4],[45,3,45,4],[45,5,45,6],[45,7,45,8],[46,3,46,4],[46,5,46,6],[47,3,47,4],[47,5,47,6],[4,0,4,6],[4,7,4,8],[49,3,49,4],[49,5,49,6],[49,7,49,8],[48,3,48,4],[48,5,48,6],[48,7,48,8],[50,3,50,4],[50,5,50,6],[50,7,50,8],[161,0,161,9],[129,0,129,9],[120,0,120,9],[104,0,104,9],[66,0,66,5],[66,6,66,9],[79,0,79,9],[80,0,80,9],[81,0,81,9],[82,0,82,9],[100,0,100,9],[88,0,88,9],[89,0,89,9],[90,0,90,9],[91,0,91,9],[92,0,92,9],[93,0,93,9],[94,0,94,9],[95,0,95,9],[96,0,96,9],[97,0,97,9],[98,0,98,9],[83,0,83,9],[87,0,87,9],[162,0,162,9],[164,0,164,9],[173,0,173,9],[165,0,165,9],[166,0,166,9],[167,0,167,9],[168,0,168,9],[169,0,169,9],[170,0,170,9],[171,0,171,9],[172,0,172,9],[53,0,53,9],[54,0,54,9],[56,0,56,9],[59,0,59,9],[60,0,60,9],[61,0,61,9],[63,0,63,9],[57,0,57,9],[58,0,58,9],[182,0,182,9],[156,0,156,9],[157,0,157,9],[158,0,158,9],[177,0,177,9],[159,0,159,9],[68,0,68,9],[151,0,151,9],[153,0,153,9],[154,0,154,9],[155,0,155,9],[116,0,116,9],[135,0,135,9],[118,0,118,9],[102,0,102,9],[85,0,85,9],[130,0,130,9],[131,0,131,9],[132,0,132,9],[148,0,148,9],[174,0,174,9],[175,0,175,9],[163,0,163,9],[179,0,179,9]]}
[]
[]
[]
[]
["Financiële controle op de uitgaven van het jaar:",null,null,null,null,null,null,{"$f":"RIGHT('BUDGET VS ACTUAL'!C14,4)","v":"2021"}]
["van het project: "]
[{"$f":"'GOEDGEKEURD BUDGET AJU'!E10","v":0}]
[]
["Directie / Dienst Fedasil : Directie Algemene Diensten, Dienst BF",null,null,null,null,null,null,"Datum:",{"$f":"TODAY()","v":"2020-09-11"}]
["Contactpersoon Fedasil : ",null,null,null,null,null,null,"Bijlage: "]
[]
[]
[{"$f":"BUDGETAANVRAAG!C9","v":"Begunstigde:"},{"$f":"'BUDGET VS ACTUAL'!Q9","v":0}]
[{"$f":"BUDGETAANVRAAG!C10","v":"Project:"},{"$f":"'BUDGET VS ACTUAL'!Q10","v":0}]
["Financieel Contactpersoon vzw",{"$f":"'BUDGET VS ACTUAL'!Q11","v":0}]
[{"$f":"BUDGETAANVRAAG!C12","v":"Looptijd project (aantal maanden):"},{"$f":"'BUDGET VS ACTUAL'!Q12","v":0}]
["Conventiecode",{"$f":"'Bijkomende vragen Fin Verslag'!A3","v":"2021/XX"}]
[]
["Conventie"]
[{"$f":"CONCATENATE(\"Conventie\",\" \",B17)","v":"Conventie 2021/XX"},"met betrekking tot de toekenning van een subsidie van €xxxx met als doel "]
["(zie beschrijving in conventie)"]
[]
[]
["De Controle"]
["De financiële controle werd uitgevoerd a.d.h.v. het financiële dossier die elektronisch ingediend werd op dd/mm/yy. "]
["Er werd een steekproef genomen van de uitgaven gefinancierd door de conventie ",null,null,null,null,{"$f":"B17","v":"2021/XX"}]
[{"$f":"CONCATENATE(\"Een extra vragenlijst met betrekking tot de ingediende uitgaven\",\" \",H5,\" werd op \",\"dd/mm/yy verstuurd naar \",A7)","v":"Een extra vragenlijst met betrekking tot de ingediende uitgaven 2021 werd op dd/mm/yy verstuurd naar 0"}]
["Er werd geen controlebezoek gedaan ter plaatse, maar per mail en telefonisch werden alle resterende vragen en opmerkingen overlopen."]
[]
[]
["Vaststellingen"]
[]
["1.      Financiering van het project "]
[]
["Schuldvorderingen ontvangen door Fedasil: "]
[]
["Subsidiebedrag","Bedrag","%","Datum betaling"]
[{"$f":"C38%*A41","v":0},0,50]
[{"$f":"C39%*A41","v":0},0,30]
[{"$f":"20%*A41","v":0},0,"Saldo ","na controle"]
[{"$f":"'BUDGET VS ACTUAL'!W61","v":0},{"$f":"SUM(B38:B40)","v":0},"TOTAAL"]
[]
[]
["2.      Budgetuitputting"]
[]
["Kostensoort","Budget INI","Budget AJU","Werkelijke uitgaven",null,"Variantie (€)",null,"Variantie (%)"]
["Personeel",{"$f":"C47","v":0},{"$f":"'BUDGET VS ACTUAL'!W24","v":0},{"$f":"'BUDGET VS ACTUAL'!AL24","v":0},null,{"$f":"C47-D47","v":0},null,{"$f":"IFERROR(D47/C47,\"0%\")","v":"0%"}]
["Huur",{"$f":"C48","v":0},{"$f":"'BUDGET VS ACTUAL'!W27","v":0},{"$f":"'BUDGET VS ACTUAL'!AL27","v":0},null,{"$f":"C48-D48","v":0},null,{"$f":"IFERROR(D48/C48,\"0%\")","v":"0%"}]
["Investeringen",{"$f":"C49","v":0},{"$f":"'BUDGET VS ACTUAL'!W33","v":0},{"$f":"'BUDGET VS ACTUAL'!AL33","v":0},null,{"$f":"C49-D49","v":0},null,"0%"]
["Directe werkingskosten",{"$f":"C50","v":0},{"$f":"'BUDGET VS ACTUAL'!W46","v":0},{"$f":"'BUDGET VS ACTUAL'!AL46","v":0},null,0,null,"0%"]
["Indirecte werkingskosten",{"$f":"C51","v":0},{"$f":"'BUDGET VS ACTUAL'!W59","v":0},{"$f":"'BUDGET VS ACTUAL'!AL59","v":0},null,0,null,"0%"]
["Totaal",{"$f":"SUM(B47:B51)","v":0},{"$f":"SUM(C47:C51)","v":0},{"$f":"SUM(D47:E51)","v":0},null,{"$f":"SUM(F47:G51)","v":0},null,{"$f":"IFERROR(D52/C52,\"0%\")","v":"0%"}]
[]
["De vzw heeft in mm/yy een budgetwijziging aangevraagd die op dd/mm/yy, na evaluatie en aanpassing, is goedgekeurd door Fedasil. "]
["De grootste wijzigingen ten opzichte van het initieel budget is op vlak van:"]
[]
[" - personeel:"]
[]
[]
[]
[" - Indirecte werkingskosten"]
[]
[]
[]
[" - etc"]
[]
["3.     Resultaat Controle"]
[]
["A.      Personeelskosten"]
[]
["Het Agentschap heeft een controle uitgevoerd van xx% op de personeelskosten. Hieruit blijkt dat:"]
[]
[]
[]
[]
[]
[]
[]
[]
[]
[]
[]
[]
["Totale personeelskosten die niet subsidiabel zijn: xx€"]
[]
["B.      Huurkosten "]
[]
["Het Agentschap heeft een controle uitgevoerd van xx% op de personeelskosten. Hieruit blijkt dat:"]
[]
[]
[]
[]
[]
[]
[]
[]
[]
[]
[]
[]
["Totale huurkosten die niet subsidiabel is: xx€"]
[]
["C.      Investeringen"]
[]
["Het Agentschap heeft een controle uitgevoerd van xx% op de investeringen. Hieruit blijkt dat:"]
[]
[]
[]
[]
[]
[]
[]
[]
[]
[]
[]
["Totale investeringen die niet subsidiabel is: xx€"]
[]
["D.      Directe werkingskosten"]
[]
["Het Agentschap heeft een controle uitgevoerd van xx% op de directe werkingskosten. Hieruit blijkt dat:"]
[]
[]
[]
[]
[]
[]
[]
[]
[]
[]
[]
[]
["Totale directe werkinskosten die niet subsidiabel is: xx€"]
[]
["E.      Indirecte werkingskosten "]
[]
["Het Agentschap heeft een controle uitgevoerd van xx% op de indirecte werkingskosten. Hieruit blijkt dat:"]
[]
[]
[]
[]
[]
[]
[]
[]
[]
[]
["Totale indirecte werkingskosten die niet subsidiabel is: 0,00 €"]
[]
[]
["F.      Niet subsidiabele uitgaven"]
[]
["Een totaal van €xxx is niet subsidiabel. Volgende uitgaven kunnen niet aanvaard worden door het Agentschap: "]
[]
[]
[]
[]
[]
["Aanbevelingen"]
[]
["Het Agenschap wil erop wijzen dat de kwaliteit van het ingediende rapport goed is/onvoldoende is/verbeterd is in vergelijking met vorig jaar "]
["en enigszins kan verbeterd worden dmv onderstaande aanbevelingen. Volgende aanbevelingen lijsten op wat er niet voorhanden was in het "]
["eindrapport xxxx. Het wordt ten zeerste aangeraden om volgende aanbevelingen op te volgen voor eventuele volgende projecten:"]
[]
[]
[]
[]
[]
[]
[]
[]
[]
[]
[]
[]
[]
["Conclusie"]
[]
[{"$f":"CONCATENATE(\"In de uitvoering van de conventie werd in \",H5,\" een totaalbedrag van \",D52,\"€\",\" ingediend. Na controle blijkt € xx niet subsidiabel te zijn.\" )","v":"In de uitvoering van de conventie werd in 2021 een totaalbedrag van 0€ ingediend. Na controle blijkt € xx niet subsidiabel te zijn."}]
[{"$f":"CONCATENATE(\"Het saldo van de conventie\",B17,\" \",\"voor een bedrag van €xxxx zal gestort worden op het rekeningnummer\",'STAP 1'!D17,\" met vermelding \n“Saldo \",B17,\" \",\"naam project van \",A7)","v":"Het saldo van de conventie2021/XX voor een bedrag van €xxxx zal gestort worden op het rekeningnummer met vermelding \n“Saldo 2021/XX naam project van 0"}]
[]
["OF Aangezien de voorschotten betaald door het Agentschap (€xx) groter zijn dan de totale werkelijke subsidiabele uitgaven (€xx), willen wij "]
[" u vragen het resterende bedrag van €xx terug te storten, op het rekeningnummer BE58 0910 1265 3879  met als vermelding "]
[{"$f":"CONCATENATE(B17, A7,\" saldo\", H5,\" , binnen de 30 dagen na ontvangst van deze brief. \")","v":"2021/XX0 saldo2021 , binnen de 30 dagen na ontvangst van deze brief. "}]

{"sheet":"Dropdownlijst","index":23,"n_rows":14,"n_cols":8,"rows_kept":14,"cut":false,"hidden":true,"merged":[]}
[]
[null,"Kies uit lijst Financiering","Zekerheid",null,"OK?","Kies uit lijst Directe Werkingskosten","Kies uit lijst Indirecte Werkingskosten","Aanbevelingen"]
[null,"Andere Inkomsten","Aangevraagd",null,"JA","Rekruteringskosten","Water"," - De boekhoudkundige overzichten bezorgen die toelaten voor elke kost en opbrengst de boekhoudkundige en analytische bestemming gemakkelijk terug te vinden, zoals vermeld in het financieel vademecum op pagina 5."]
[null,"Eigen middelen","Voorlopig ",null,"NEE","Sociaal secretariaat","Elektriciteit"," - Alle personeelskosten die ingebracht worden moeten duidelijk teruggevonden kunnen worden op de individuele fiche van het sociaal secretariaat. "]
[null,"(in te vullen)","Goedgekeurd",null,null,"Arbeidsdokter","Verwarming"," - Alle uitgaven moeten bewezen worden met een bewijsstuk en moeten samen met het einddossier ingediend worden."]
[null,null,"(in te vullen)",null,null,"Verplaatsingskosten - opdracht (per km)","Onderhoudskosten gebouw"," - Als er wijzigingen gebeuren tov het goedgekeurde budget, moet het Agentschap hierover onmiddellijk schriftelijk geïnformeerd worden. De begunstige kan tijdens de uitvoering de begroting aanpassen door overdrachten \ntussen verschillende kostensoorten van het budget, mits deze aanpassing de uitvoering niet in de weg staat en het bedrag van de overdracht tussen de kostensoorten niet meer bedraagt dan 10% van het bedrag van elke kostensoort. Het Agentschap kan ook uitzonderlijk overdrachten tussen kostensoorten van meer dan 10% van het bedrag van elke kostensoort aanvaarden mits deze aanpassing de uitvoering van de activiteit niet in de weg staat en zonder dat het bedrag aan totale subsidiabele kosten wijzigt. De begunstigde dient voorafgaandelijk schriftelijk het akkoord van het Agentschap te vragen aan de hand van een verzoek tot budgetwijziging, dat bestaat uit een vergelijking van de aangepaste en oorspronkelijke begroting en een uitgebreide argumentatie voor alle aanpassingen. Zie het Financieel Vademecum op pagina 2 en 3."]
[null,null,null,null,null,"Opleidingen","Onderhoudskosten informatica","  - In het financieel eindrapport moet steeds het overeengekomen subsidiebedrag vermeld worden bij ‘subsidievraag Fedasil’. Indien er andere budgetten zijn voor het H13 gelieve dat onder te brengen in de \n‘andere financieringsbronnen’ zoals inkomsten, eigen middelen, etc. Indien de reële uitgaven voor Fedasil hoger zijn dan de subsidies, gelieve het rest bedrag te zetten bij de andere reële financieringsbronnen."]
[null,null,null,null,null,"Publicatiekosten ","Afvalverwerking"," - Timesheets moeten een reflectie zijn van de ingediende personeelskosten per maand. "]
[null,null,null,null,null,"Documentatie","Telefoonkosten"," - Gelieve rekening mee te houden dat alle activiteiten en hun betrokken kosten buiten het subsidiejaar niet mogen terugbetaald worden door het Agentschap."]
[null,null,null,null,null,"Gsm-kosten","Verzekeringen"," - Gelieve in de toekomst rekening te houden dat onder de directe werkingskosten enkel kosten kunnen ingediend worden die 100% toewijsbaar zijn aan het project. Andere uitgaven die verdeeld worden over de verschillende projectwerkingen moeten onder de andere werkingskosten ingediend worden. "]
[null,null,null,null,null,"Vertaal-en tolkkosten","Boekhoudkosten"," - Indien een opleiding ingediend wordt, moet steeds een korte inhoud/folder worden toegevoegd. Ook moet de naam van het personeelslid die de opleiding heeft gevolgd, steeds vermeld worden. "]
[null,null,null,null,null,"Onderaanneming ","Kosten drukwerk en publiciteit"," - Gelieve steeds na te gaan bij elke ingediende kost of een externe persoon deze uitgaven kan reconciliëren aan de hand van de ingediende bewijsstukken en dat er totale transparantie is."]
[null,null,null,null,null,"Vergoedingen van vrijwilligers","Kantoorbenodigdheden"," - Gelieve duidelijke verdeelsleutels op te maken die rekening houden met alle projecten van de organisatie, de grootte van de projecten, maar ook met de gewone werking van de organisatie. "]
[null,null,null,null,null,null,"Verzendingskosten"," - Indien een personeelslid geen 100% voor het project werkt en/of geen 100% door het Agentschap gefinancierd wordt, moeten een annexe aan de arbeidsovereenkomst en timesheets opgemaakt worden. "]